{"text_format":"1","workbook":"xlsx","n_sheets":5,"sheets":["Fixtures","Grid","McRopod","LaddersH","Ladders"],"not_rendered":{"charts":0,"images":0,"macros":1,"external_links":0,"defined_names":6,"comments":0,"pivot_tables":0},"unopened":[],"bounds":{"document_bytes":16777216,"sheet_cells":100000,"rows_first":2000,"rows_last":500,"rows_between":2000,"halvings":0,"cell_chars":16384,"cell_head_chars":4096},"cells_cut":0,"cells_raw":0,"read":"whole","date_system":"1900"}

{"sheet":"Fixtures","index":0,"n_rows":95,"n_cols":13,"rows_kept":95,"cut":false,"hidden":false,"merged":[]}
[null,"Select Fixtures and Results",null,"Sort Ladders to see Rankings"]
[null,"Date","Home",null,"Away","Score","Score"]
[null,null,"Group C:"]
[null,"2024-09-05","Japan ","v"," China",7,0,null,1,2,null,"JAP","CHN"]
[null,"2024-09-05","Australia ","v"," Bahrain",0,1,null,3,4,null,"AUS","BAH"]
[null,"2024-09-05","Saudi Arabia ","v"," Indonesia",1,1,null,5,6,null,"SAU","IND"]
[null,"2024-09-10","Bahrain ","v"," Japan",0,5,null,4,1,null,"BAH","JAP"]
[null,"2024-09-10","China ","v"," Saudi Arabia",1,2,null,2,5,null,"CHN","SAU"]
[null,"2024-09-10","Indonesia ","v"," Australia",0,0,null,6,3,null,"IND","AUS"]
[null,"2024-10-10","Australia ","v"," China",3,1,null,3,2,null,"AUS","CHN"]
[null,"2024-10-10","Saudi Arabia ","v"," Japan",0,2,null,5,1,null,"SAU","JAP"]
[null,"2024-10-10","Bahrain ","v"," Indonesia",2,2,null,4,6,null,"BAH","IND"]
[null,"2024-10-15","Japan ","v"," Australia",1,1,null,1,3,null,"JAP","AUS"]
[null,"2024-10-15","Saudi Arabia ","v"," Bahrain",0,0,null,5,4,null,"SAU","BAH"]
[null,"2024-10-15","China ","v"," Indonesia",2,1,null,2,6,null,"CHN","IND"]
[null,"2024-11-14","Australia ","v"," Saudi Arabia",null,null,null,3,5,null,"AUS","SAU"]
[null,"2024-11-14","Bahrain ","v"," China",null,null,null,4,2,null,"BAH","CHN"]
[null,"2024-11-14","Indonesia ","v"," Japan",null,null,null,6,1,null,"IND","JAP"]
[null,"2024-11-19","Bahrain ","v"," Australia",null,null,null,4,3,null,"BAH","AUS"]
[null,"2024-11-19","China ","v"," Japan",null,null,null,2,1,null,"CHN","JAP"]
[null,"2024-11-19","Indonesia ","v"," Saudi Arabia",null,null,null,6,5,null,"IND","SAU"]
[null,"2025-03-20","Japan ","v"," Bahrain",null,null,null,1,4,null,"JAP","BAH"]
[null,"2025-03-20","Australia ","v"," Indonesia",null,null,null,3,6,null,"AUS","IND"]
[null,"2025-03-20","Saudi Arabia ","v"," China",null,null,null,5,2,null,"SAU","CHN"]
[null,"2025-03-25","Japan ","v"," Saudi Arabia",null,null,null,1,5,null,"JAP","SAU"]
[null,"2025-03-25","China ","v"," Australia",null,null,null,2,3,null,"CHN","AUS"]
[null,"2025-03-25","Indonesia ","v"," Bahrain",null,null,null,6,4,null,"IND","BAH"]
[null,"2025-06-05","Australia ","v"," Japan",null,null,null,3,1,null,"AUS","JAP"]
[null,"2025-06-05","Bahrain ","v"," Saudi Arabia",null,null,null,4,5,null,"BAH","SAU"]
[null,"2025-06-05","Indonesia ","v"," China",null,null,null,6,2,null,"IND","CHN"]
[null,"2025-06-10","Japan ","v"," Indonesia",null,null,null,1,6,null,"JAP","IND"]
[null,"2025-06-10","Saudi Arabia ","v"," Australia",null,null,null,5,3,null,"SAU","AUS"]
[null,"2025-06-10","China ","v"," Bahrain",null,null,null,2,4,null,"CHN","BAH"]
[null,null,"Group B:"]
[null,"2024-09-05","South Korea ","v"," Palestine",0,0,null,21,22,null,"KOR","PAL"]
[null,"2024-09-05","Iraq ","v"," Oman",1,0,null,23,24,null,"IRQ","OMA"]
[null,"2024-09-05","Jordan ","v"," Kuwait",1,1,null,25,26,null,"JOR","KUW"]
[null,"2024-09-10","Palestine ","v"," Jordan",1,3,null,22,25,null,"PAL","JOR"]
[null,"2024-09-10","Oman ","v"," South Korea",1,3,null,24,21,null,"OMA","KOR"]
[null,"2024-09-10","Kuwait ","v"," Iraq",0,0,null,26,23,null,"KUW","IRQ"]
[null,"2024-10-10","Iraq ","v"," Palestine",1,0,null,23,22,null,"IRQ","PAL"]
[null,"2024-10-10","Jordan ","v"," South Korea",0,2,null,25,21,null,"JOR","KOR"]
[null,"2024-10-10","Oman ","v"," Kuwait",4,0,null,24,26,null,"OMA","KUW"]
[null,"2024-10-15","South Korea ","v"," Iraq",3,2,null,21,23,null,"KOR","IRQ"]
[null,"2024-10-15","Jordan ","v"," Oman",4,0,null,25,24,null,"JOR","OMA"]
[null,"2024-10-15","Palestine ","v"," Kuwait",2,2,null,22,26,null,"PAL","KUW"]
[null,"2024-11-14","Iraq ","v"," Jordan",null,null,null,23,25,null,"IRQ","JOR"]
[null,"2024-11-14","Oman ","v"," Palestine",null,null,null,24,22,null,"OMA","PAL"]
[null,"2024-11-14","Kuwait ","v"," South Korea",null,null,null,26,21,null,"KUW","KOR"]
[null,"2024-11-19","Oman ","v"," Iraq",null,null,null,24,23,null,"OMA","IRQ"]
[null,"2024-11-19","Palestine ","v"," South Korea",null,null,null,22,21,null,"PAL","KOR"]
[null,"2024-11-19","Kuwait ","v"," Jordan",null,null,null,26,25,null,"KUW","JOR"]
[null,"2025-03-20","South Korea ","v"," Oman",null,null,null,21,24,null,"KOR","OMN"]
[null,"2025-03-20","Iraq ","v"," Kuwait",null,null,null,23,26,null,"IRQ","KUW"]
[null,"2025-03-20","Jordan ","v"," Palestine",null,null,null,25,22,null,"JOR","PAL"]
[null,"2025-03-25","South Korea ","v"," Jordan",null,null,null,21,25,null,"KOR","JOR"]
[null,"2025-03-25","Palestine ","v"," Iraq",null,null,null,22,23,null,"PAL","IRQ"]
[null,"2025-03-25","Kuwait ","v"," Oman",null,null,null,26,24,null,"KUW","OMA"]
[null,"2025-06-05","Iraq ","v"," South Korea",null,null,null,23,21,null,"IRQ","KOR"]
[null,"2025-06-05","Oman ","v"," Jordan",null,null,null,24,25,null,"OMA","JOR"]
[null,"2025-06-05","Kuwait ","v"," Palestine",null,null,null,26,22,null,"KUW","PAL"]
[null,"2025-06-10","South Korea ","v"," Kuwait",null,null,null,21,26,null,"KOR","KUW"]
[null,"2025-06-10","Jordan ","v"," Iraq",null,null,null,25,23,null,"JOR","IRQ"]
[null,"2025-06-10","Palestine ","v"," Oman",null,null,null,22,24,null,"PAL","OMA"]
[null,null,"Group A:"]
[null,"2024-09-05","Uzbekistan ","v"," North Korea",1,0,null,31,32,null,"UZB","NKR"]
[null,"2024-09-05","Iran ","v"," Kyrgyzstan",1,0,null,33,34,null,"IRN","KRG"]
[null,"2024-09-05","Qatar ","v"," United Arab Emirates",1,3,null,35,36,null,"QAT","UAE"]
[null,"2024-09-10","North Korea ","v"," Qatar",2,2,null,32,35,null,"NKR","QAT"]
[null,"2024-09-10","Kyrgyzstan ","v"," Uzbekistan",2,3,null,34,31,null,"KRG","UZB"]
[null,"2024-09-10","United Arab Emirates ","v"," Iran",0,1,null,36,33,null,"UAE","IRN"]
[null,"2024-10-10","Uzbekistan ","v"," Iran",0,0,null,31,33,null,"UZB","IRN"]
[null,"2024-10-10","Qatar ","v"," Kyrgyzstan",3,1,null,35,34,null,"QAT","KRG"]
[null,"2024-10-10","United Arab Emirates ","v"," North Korea",1,1,null,36,32,null,"UAE","NKR"]
[null,"2024-10-15","Uzbekistan ","v"," United Arab Emirates",1,0,null,31,36,null,"UZB","UAE"]
[null,"2024-10-15","Kyrgyzstan ","v"," North Korea",1,0,null,34,32,null,"KRG","NKR"]
[null,"2024-10-15","Iran ","v"," Qatar",4,1,null,33,35,null,"IRN","QAT"]
[null,"2024-11-14","Qatar ","v"," Uzbekistan",null,null,null,35,31,null,"QAT","UZB"]
[null,"2024-11-14","United Arab Emirates ","v"," Kyrgyzstan",null,null,null,36,34,null,"UAE","KRG"]
[null,"2024-11-14","North Korea ","v"," Iran",null,null,null,32,33,null,"NKR","IRN"]
[null,"2024-11-19","United Arab Emirates ","v"," Qatar",null,null,null,36,35,null,"UAE","QAT"]
[null,"2024-11-19","Kyrgyzstan ","v"," Iran",null,null,null,34,33,null,"KRG","IRN"]
[null,"2024-11-19","North Korea ","v"," Uzbekistan",null,null,null,32,31,null,"NKR","UZB"]
[null,"2025-03-20","Iran ","v"," United Arab Emirates",null,null,null,33,36,null,"IRN","UAE"]
[null,"2025-03-20","Qatar ","v"," North Korea",null,null,null,35,32,null,"QAT","NKR"]
[null,"2025-03-20","Uzbekistan ","v"," Kyrgyzstan",null,null,null,31,34,null,"UZB","KRG"]
[null,"2025-03-25","Iran ","v"," Uzbekistan",null,null,null,33,31,null,"IRN","UZB"]
[null,"2025-03-25","Kyrgyzstan ","v"," Qatar",null,null,null,34,35,null,"KRG","QAT"]
[null,"2025-03-25","North Korea ","v"," United Arab Emirates",null,null,null,32,36,null,"NKR","UAE"]
[null,"2025-06-05","Qatar ","v"," Iran",null,null,null,35,33,null,"QAT","IRN"]
[null,"2025-06-05","United Arab Emirates ","v"," Uzbekistan",null,null,null,36,31,null,"UAE","UZB"]
[null,"2025-06-05","North Korea ","v"," Kyrgyzstan",null,null,null,32,34,null,"NKR","KRG"]
[null,"2025-06-10","Iran ","v"," North Korea",null,null,null,33,32,null,"IRN","NKR"]
[null,"2025-06-10","Uzbekistan ","v"," Qatar",null,null,null,31,35,null,"UZB","QAT"]
[null,"2025-06-10","Kyrgyzstan ","v"," United Arab Emirates",null,null,null,34,36,null,"KRG","UAE"]

{"sheet":"Grid","index":1,"n_rows":60,"n_cols":48,"rows_kept":60,"cut":false,"hidden":false,"merged":[]}
[null,null,null,null,null,null,null,null,null,null,null,null,null,null,null,null,null,null,null,null,null,null,null,null,"Home",null,null,null,null,null,null,null,null,"Away"]
[]
[]
[]
[]
[]
[]
[]
[]
[]
[]
[]
[]
[]
[]
[]
[]
[]
[]
[]
[]
[]
[]
[]
[]
[]
[]
[]
[]
[]
[null,null,null,null,null,null,null,null,null,null,null,null,null,null,null,null,null,null,null,null,null,null,null,null,"Home",null,null,null,null,null,null,null,null,"Away"]
[null,"Group A",null,{"$f":"B33","v":"Uzbekistan "},null,null,{"$f":"B34","v":"Iran "},null,null,{"$f":"B35","v":"Qatar "},null,null,{"$f":"B36","v":" North Korea"},null,null,{"$f":"B37","v":" Kyrgyzstan"},null,null,{"$f":"B38","v":" United Arab Emirates"},null,null,null,"P","W","D","L","F","A","G/D","Pts",null,"P","W","D","L","F","A","G/D","Pts",{"$f":"IF(SUM(AO33:AO38)=60,\"Group Completed\",\"Group Incomplete\")","v":"Group Incomplete"},"P","W","D","L","F","A","G/D","Pts"]
[null,{"$f":"Fixtures!C66","v":"Uzbekistan "},null,null,{"$f":"IF(C33=\"\",\"\",IF(D33=\"\",\"\",IF(C33>D33,\"W\",IF(C33<D33,\"L\",IF(C33=D33,\"D\")))))","v":""},{"$f":"IF(Fixtures!$F$72=\"\",\"\",Fixtures!$F$72)","v":0},{"$f":"IF(Fixtures!$G$72=\"\",\"\",Fixtures!$G$72)","v":0},{"$f":"IF(F33=\"\",\"\",IF(G33=\"\",\"\",IF(F33>G33,\"W\",IF(F33<G33,\"L\",IF(F33=G33,\"D\")))))","v":"D"},{"$f":"IF(Fixtures!$F$94=\"\",\"\",Fixtures!$F$94)","v":""},{"$f":"IF(Fixtures!$G$94=\"\",\"\",Fixtures!$G$94)","v":""},{"$f":"IF(I33=\"\",\"\",IF(J33=\"\",\"\",IF(I33>J33,\"W\",IF(I33<J33,\"L\",IF(I33=J33,\"D\")))))","v":""},{"$f":"IF(Fixtures!$F$66=\"\",\"\",Fixtures!$F$66)","v":1},{"$f":"IF(Fixtures!$G$66=\"\",\"\",Fixtures!$G$66)","v":0},{"$f":"IF(L33=\"\",\"\",IF(M33=\"\",\"\",IF(L33>M33,\"W\",IF(L33<M33,\"L\",IF(L33=M33,\"D\")))))","v":"W"},{"$f":"IF(Fixtures!$F$86=\"\",\"\",Fixtures!$F$86)","v":""},{"$f":"IF(Fixtures!$G$86=\"\",\"\",Fixtures!$G$86)","v":""},{"$f":"IF(O33=\"\",\"\",IF(P33=\"\",\"\",IF(O33>P33,\"W\",IF(O33<P33,\"L\",IF(O33=P33,\"D\")))))","v":""},{"$f":"IF(Fixtures!$F$75=\"\",\"\",Fixtures!$F$75)","v":1},{"$f":"IF(Fixtures!$G$75=\"\",\"\",Fixtures!$G$75)","v":0},{"$f":"IF(R33=\"\",\"\",IF(S33=\"\",\"\",IF(R33>S33,\"W\",IF(R33<S33,\"L\",IF(R33=S33,\"D\")))))","v":"W"},null,null,{"$f":"SUM(X33:Z33)","v":3},{"$f":"IF(E33=\"W\",1,0)+IF(H33=\"W\",1,0)+IF(K33=\"W\",1,0)+IF(N33=\"W\",1,0)+IF(Q33=\"W\",1,0)+IF(T33=\"W\",1,0)","v":2},{"$f":"IF(E33=\"D\",1,0)+IF(H33=\"D\",1,0)+IF(K33=\"D\",1,0)+IF(N33=\"D\",1,0)+IF(Q33=\"D\",1,0)+IF(T33=\"D\",1,0)","v":1},{"$f":"IF(E33=\"L\",1,0)+IF(H33=\"L\",1,0)+IF(K33=\"L\",1,0)+IF(N33=\"L\",1,0)+IF(Q33=\"L\",1,0)+IF(T33=\"L\",1,0)","v":0},{"$f":"SUM(C33)+SUM(F33)+SUM(I33)+SUM(L33)+SUM(O33)+SUM(R33)","v":2},{"$f":"SUM(D33)+SUM(G33)+SUM(J33)+SUM(M33)+SUM(P33)+SUM(S33)","v":0},{"$f":"AA33-AB33","v":2},{"$f":"X33*3+Y33","v":7},null,{"$f":"SUM(AG33:AI33)","v":1},{"$f":"C39","v":1},{"$f":"D39","v":0},{"$f":"E39","v":0},{"$f":"C40","v":3},{"$f":"D40","v":2},{"$f":"AJ33-AK33","v":1},{"$f":"AG33*3+AH33","v":3},{"$f":"B33","v":"Uzbekistan "},{"$f":"W33+AF33","v":4},{"$f":"X33+AG33","v":3},{"$f":"Y33+AH33","v":1},{"$f":"Z33+AI33","v":0},{"$f":"AA33+AJ33","v":5},{"$f":"AB33+AK33","v":2},{"$f":"AC33+AL33","v":3},{"$f":"AD33+AM33","v":10}]
[null,{"$f":"Fixtures!C67","v":"Iran "},{"$f":"IF(Fixtures!$F$87=\"\",\"\",Fixtures!$F$87)","v":""},{"$f":"IF(Fixtures!$G$87=\"\",\"\",Fixtures!$G$87)","v":""},{"$f":"IF(C34=\"\",\"\",IF(D34=\"\",\"\",IF(C34>D34,\"W\",IF(C34<D34,\"L\",IF(C34=D34,\"D\")))))","v":""},null,null,{"$f":"IF(F34=\"\",\"\",IF(G34=\"\",\"\",IF(F34>G34,\"W\",IF(F34<G34,\"L\",IF(F34=G34,\"D\")))))","v":""},{"$f":"IF(Fixtures!$F$77=\"\",\"\",Fixtures!$F$77)","v":4},{"$f":"IF(Fixtures!$G$77=\"\",\"\",Fixtures!$G$77)","v":1},{"$f":"IF(I34=\"\",\"\",IF(J34=\"\",\"\",IF(I34>J34,\"W\",IF(I34<J34,\"L\",IF(I34=J34,\"D\")))))","v":"W"},{"$f":"IF(Fixtures!$F$93=\"\",\"\",Fixtures!$F$93)","v":""},{"$f":"IF(Fixtures!$G$93=\"\",\"\",Fixtures!$G$93)","v":""},{"$f":"IF(L34=\"\",\"\",IF(M34=\"\",\"\",IF(L34>M34,\"W\",IF(L34<M34,\"L\",IF(L34=M34,\"D\")))))","v":""},{"$f":"IF(Fixtures!$F$67=\"\",\"\",Fixtures!$F$67)","v":1},{"$f":"IF(Fixtures!$G$67=\"\",\"\",Fixtures!$G$67)","v":0},{"$f":"IF(O34=\"\",\"\",IF(P34=\"\",\"\",IF(O34>P34,\"W\",IF(O34<P34,\"L\",IF(O34=P34,\"D\")))))","v":"W"},{"$f":"IF(Fixtures!$F$84=\"\",\"\",Fixtures!$F$84)","v":""},{"$f":"IF(Fixtures!$G$84=\"\",\"\",Fixtures!$G$84)","v":""},{"$f":"IF(R34=\"\",\"\",IF(S34=\"\",\"\",IF(R34>S34,\"W\",IF(R34<S34,\"L\",IF(R34=S34,\"D\")))))","v":""},null,null,{"$f":"SUM(X34:Z34)","v":2},{"$f":"IF(E34=\"W\",1,0)+IF(H34=\"W\",1,0)+IF(K34=\"W\",1,0)+IF(N34=\"W\",1,0)+IF(Q34=\"W\",1,0)+IF(T34=\"W\",1,0)","v":2},{"$f":"IF(E34=\"D\",1,0)+IF(H34=\"D\",1,0)+IF(K34=\"D\",1,0)+IF(N34=\"D\",1,0)+IF(Q34=\"D\",1,0)+IF(T34=\"D\",1,0)","v":0},{"$f":"IF(E34=\"L\",1,0)+IF(H34=\"L\",1,0)+IF(K34=\"L\",1,0)+IF(N34=\"L\",1,0)+IF(Q34=\"L\",1,0)+IF(T34=\"L\",1,0)","v":0},{"$f":"SUM(C34)+SUM(F34)+SUM(I34)+SUM(L34)+SUM(O34)+SUM(R34)","v":5},{"$f":"SUM(D34)+SUM(G34)+SUM(J34)+SUM(M34)+SUM(P34)+SUM(S34)","v":1},{"$f":"AA34-AB34","v":4},{"$f":"X34*3+Y34","v":6},null,{"$f":"SUM(AG34:AI34)","v":2},{"$f":"F39","v":1},{"$f":"G39","v":1},{"$f":"H39","v":0},{"$f":"F40","v":1},{"$f":"G40","v":0},{"$f":"AJ34-AK34","v":1},{"$f":"AG34*3+AH34","v":4},{"$f":"B34","v":"Iran "},{"$f":"W34+AF34","v":4},3,1,0,6,1,5,10]
[null,{"$f":"Fixtures!C68","v":"Qatar "},{"$f":"IF(Fixtures!$F$78=\"\",\"\",Fixtures!$F$78)","v":""},{"$f":"IF(Fixtures!$G$78=\"\",\"\",Fixtures!$G$78)","v":""},"",{"$f":"IF(Fixtures!$F$90=\"\",\"\",Fixtures!$F$90)","v":""},{"$f":"IF(Fixtures!$G$90=\"\",\"\",Fixtures!$G$90)","v":""},"",null,null,"",{"$f":"IF(Fixtures!$F$85=\"\",\"\",Fixtures!$F$85)","v":""},{"$f":"IF(Fixtures!$G$85=\"\",\"\",Fixtures!$G$85)","v":""},"",{"$f":"IF(Fixtures!$F$73=\"\",\"\",Fixtures!$F$73)","v":3},{"$f":"IF(Fixtures!$G$73=\"\",\"\",Fixtures!$G$73)","v":1},"W",{"$f":"IF(Fixtures!$F$68=\"\",\"\",Fixtures!$F$68)","v":1},{"$f":"IF(Fixtures!$G$68=\"\",\"\",Fixtures!$G$68)","v":3},"L",null,null,2,1,0,1,4,4,0,3,null,2,{"$f":"I39","v":0},{"$f":"J39","v":1},{"$f":"K39","v":1},{"$f":"I40","v":3},{"$f":"J40","v":6},-3,1,"Qatar ",4,1,1,2,7,10,-3,4]
[null,{"$f":"Fixtures!E66","v":" North Korea"},{"$f":"IF(Fixtures!$F$83=\"\",\"\",Fixtures!$F$83)","v":""},{"$f":"IF(Fixtures!$G$83=\"\",\"\",Fixtures!$G$83)","v":""},"",{"$f":"IF(Fixtures!$F$80=\"\",\"\",Fixtures!$F$80)","v":""},{"$f":"IF(Fixtures!$G$80=\"\",\"\",Fixtures!$G$80)","v":""},"",{"$f":"IF(Fixtures!$F$69=\"\",\"\",Fixtures!$F$69)","v":2},{"$f":"IF(Fixtures!$G$69=\"\",\"\",Fixtures!$G$69)","v":2},"D",null,null,"",{"$f":"IF(Fixtures!$F$92=\"\",\"\",Fixtures!$F$92)","v":""},{"$f":"IF(Fixtures!$G$92=\"\",\"\",Fixtures!$G$92)","v":""},"",{"$f":"IF(Fixtures!$F$89=\"\",\"\",Fixtures!$F$89)","v":""},{"$f":"IF(Fixtures!$G$89=\"\",\"\",Fixtures!$G$89)","v":""},"",null,null,1,0,1,0,2,2,0,1,null,3,{"$f":"L39","v":0},{"$f":"M39","v":1},{"$f":"N39","v":2},{"$f":"L40","v":1},{"$f":"M40","v":3},-2,1," North Korea",4,0,2,2,3,5,-2,2]
[null,{"$f":"Fixtures!E67","v":" Kyrgyzstan"},{"$f":"IF(Fixtures!$F$70=\"\",\"\",Fixtures!$F$70)","v":2},{"$f":"IF(Fixtures!$G$70=\"\",\"\",Fixtures!$G$70)","v":3},"L",{"$f":"IF(Fixtures!$F$82=\"\",\"\",Fixtures!$F$82)","v":""},{"$f":"IF(Fixtures!$G$82=\"\",\"\",Fixtures!$G$82)","v":""},"",{"$f":"IF(Fixtures!$F$88=\"\",\"\",Fixtures!$F$88)","v":""},{"$f":"IF(Fixtures!$G$88=\"\",\"\",Fixtures!$G$88)","v":""},"",{"$f":"IF(Fixtures!$F$76=\"\",\"\",Fixtures!$F$76)","v":1},{"$f":"IF(Fixtures!$G$76=\"\",\"\",Fixtures!$G$76)","v":0},"W",null,null,"",{"$f":"IF(Fixtures!$F$95=\"\",\"\",Fixtures!$F$95)","v":""},{"$f":"IF(Fixtures!$G$95=\"\",\"\",Fixtures!$G$95)","v":""},"",null,null,2,{"$f":"IF(E37=\"W\",1,0)+IF(H37=\"W\",1,0)+IF(K37=\"W\",1,0)+IF(N37=\"W\",1,0)+IF(Q37=\"W\",1,0)+IF(T37=\"W\",1,0)","v":1},0,1,3,3,0,3,null,2,{"$f":"O39","v":0},{"$f":"P39","v":0},{"$f":"Q39","v":2},{"$f":"O40","v":1},{"$f":"P40","v":4},-3,0," Kyrgyzstan",4,1,0,3,4,7,-3,3]
[null,{"$f":"Fixtures!E68","v":" United Arab Emirates"},{"$f":"IF(Fixtures!$F$91=\"\",\"\",Fixtures!$F$91)","v":""},{"$f":"IF(Fixtures!$G$91=\"\",\"\",Fixtures!$G$91)","v":""},"",{"$f":"IF(Fixtures!$F$71=\"\",\"\",Fixtures!$F$71)","v":0},{"$f":"IF(Fixtures!$G$71=\"\",\"\",Fixtures!$G$71)","v":1},"L",{"$f":"IF(Fixtures!$F$81=\"\",\"\",Fixtures!$F$81)","v":""},{"$f":"IF(Fixtures!$G$81=\"\",\"\",Fixtures!$G$81)","v":""},"",{"$f":"IF(Fixtures!$F$74=\"\",\"\",Fixtures!$F$74)","v":1},{"$f":"IF(Fixtures!$G$74=\"\",\"\",Fixtures!$G$74)","v":1},"D",{"$f":"IF(Fixtures!$F$79=\"\",\"\",Fixtures!$F$79)","v":""},{"$f":"IF(Fixtures!$G$79=\"\",\"\",Fixtures!$G$79)","v":""},"",null,null,"",null,null,2,{"$f":"IF(E38=\"W\",1,0)+IF(H38=\"W\",1,0)+IF(K38=\"W\",1,0)+IF(N38=\"W\",1,0)+IF(Q38=\"W\",1,0)+IF(T38=\"W\",1,0)","v":0},1,1,1,2,-1,1,null,2,{"$f":"R39","v":1},{"$f":"S39","v":0},{"$f":"T39","v":1},{"$f":"R40","v":3},{"$f":"S40","v":2},1,3," United Arab Emirates",4,1,1,2,4,4,0,4]
[null,"W/D/L",{"$f":"IF(E33=\"L\",1,0)+IF(E34=\"L\",1,0)+IF(E35=\"L\",1,0)+IF(E36=\"L\",1,0)+IF(E37=\"L\",1,0)+IF(E38=\"L\",1,0)","v":1},{"$f":"IF(E33=\"D\",1,0)+IF(E34=\"D\",1,0)+IF(E35=\"D\",1,0)+IF(E36=\"D\",1,0)+IF(E37=\"D\",1,0)+IF(E38=\"D\",1,0)","v":0},{"$f":"IF(E33=\"W\",1,0)+IF(E34=\"W\",1,0)+IF(E35=\"W\",1,0)+IF(E36=\"W\",1,0)+IF(E37=\"W\",1,0)+IF(E38=\"W\",1,0)","v":0},{"$f":"IF(H33=\"L\",1,0)+IF(H34=\"L\",1,0)+IF(H35=\"L\",1,0)+IF(H36=\"L\",1,0)+IF(H37=\"L\",1,0)+IF(H38=\"L\",1,0)","v":1},{"$f":"IF(H33=\"D\",1,0)+IF(H34=\"D\",1,0)+IF(H35=\"D\",1,0)+IF(H36=\"D\",1,0)+IF(H37=\"D\",1,0)+IF(H38=\"D\",1,0)","v":1},{"$f":"IF(H33=\"W\",1,0)+IF(H34=\"W\",1,0)+IF(H35=\"W\",1,0)+IF(H36=\"W\",1,0)+IF(H37=\"W\",1,0)+IF(H38=\"W\",1,0)","v":0},{"$f":"IF(K33=\"L\",1,0)+IF(K34=\"L\",1,0)+IF(K35=\"L\",1,0)+IF(K36=\"L\",1,0)+IF(K37=\"L\",1,0)+IF(K38=\"L\",1,0)","v":0},{"$f":"IF(K33=\"D\",1,0)+IF(K34=\"D\",1,0)+IF(K35=\"D\",1,0)+IF(K36=\"D\",1,0)+IF(K37=\"D\",1,0)+IF(K38=\"D\",1,0)","v":1},{"$f":"IF(K33=\"W\",1,0)+IF(K34=\"W\",1,0)+IF(K35=\"W\",1,0)+IF(K36=\"W\",1,0)+IF(K37=\"W\",1,0)+IF(K38=\"W\",1,0)","v":1},{"$f":"IF(N33=\"L\",1,0)+IF(N34=\"L\",1,0)+IF(N35=\"L\",1,0)+IF(N36=\"L\",1,0)+IF(N37=\"L\",1,0)+IF(N38=\"L\",1,0)","v":0},{"$f":"IF(N33=\"D\",1,0)+IF(N34=\"D\",1,0)+IF(N35=\"D\",1,0)+IF(N36=\"D\",1,0)+IF(N37=\"D\",1,0)+IF(N38=\"D\",1,0)","v":1},{"$f":"IF(N33=\"W\",1,0)+IF(N34=\"W\",1,0)+IF(N35=\"W\",1,0)+IF(N36=\"W\",1,0)+IF(N37=\"W\",1,0)+IF(N38=\"W\",1,0)","v":2},{"$f":"IF(Q33=\"L\",1,0)+IF(Q34=\"L\",1,0)+IF(Q35=\"L\",1,0)+IF(Q36=\"L\",1,0)+IF(Q37=\"L\",1,0)+IF(Q38=\"L\",1,0)","v":0},{"$f":"IF(Q33=\"D\",1,0)+IF(Q34=\"D\",1,0)+IF(Q35=\"D\",1,0)+IF(Q36=\"D\",1,0)+IF(Q37=\"D\",1,0)+IF(Q38=\"D\",1,0)","v":0},{"$f":"IF(Q33=\"W\",1,0)+IF(Q34=\"W\",1,0)+IF(Q35=\"W\",1,0)+IF(Q36=\"W\",1,0)+IF(Q37=\"W\",1,0)+IF(Q38=\"W\",1,0)","v":2},{"$f":"IF(T33=\"L\",1,0)+IF(T34=\"L\",1,0)+IF(T35=\"L\",1,0)+IF(T36=\"L\",1,0)+IF(T37=\"L\",1,0)+IF(T38=\"L\",1,0)","v":1},{"$f":"IF(T33=\"D\",1,0)+IF(T34=\"D\",1,0)+IF(T35=\"D\",1,0)+IF(T36=\"D\",1,0)+IF(T37=\"D\",1,0)+IF(T38=\"D\",1,0)","v":0},{"$f":"IF(T33=\"W\",1,0)+IF(T34=\"W\",1,0)+IF(T35=\"W\",1,0)+IF(T36=\"W\",1,0)+IF(T37=\"W\",1,0)+IF(T38=\"W\",1,0)","v":1}]
[null,"F/A",{"$f":"SUM(D33:D38)","v":3},{"$f":"SUM(C33:C38)","v":2},null,{"$f":"SUM(G33:G38)","v":1},{"$f":"SUM(F33:F38)","v":0},null,{"$f":"SUM(J33:J38)","v":3},{"$f":"SUM(I33:I38)","v":6},null,{"$f":"SUM(M33:M38)","v":1},{"$f":"SUM(L33:L38)","v":3},null,{"$f":"SUM(P33:P38)","v":1},{"$f":"SUM(O33:O38)","v":4},null,{"$f":"SUM(S33:S38)","v":3},{"$f":"SUM(R33:R38)","v":2}]
[]
[null,"Group B",null,{"$f":"B43","v":"South Korea "},null,null,{"$f":"B44","v":"Iraq "},null,null,{"$f":"B45","v":"Jordan "},null,null,{"$f":"B46","v":" Palestine"},null,null,{"$f":"B47","v":" Oman"},null,null,{"$f":"B48","v":" Kuwait"},null,null,null,"P","W","D","L","F","A","G/D","Pts",null,"P","W","D","L","F","A","G/D","Pts",{"$f":"IF(SUM(AO43:AO48)=60,\"Group Completed\",\"Group Incomplete\")","v":"Group Incomplete"},"P","W","D","L","F","A","G/D","Pts"]
[null,{"$f":"Fixtures!C35","v":"South Korea "},null,null,{"$f":"IF(C43=\"\",\"\",IF(D43=\"\",\"\",IF(C43>D43,\"W\",IF(C43<D43,\"L\",IF(C43=D43,\"D\")))))","v":""},{"$f":"IF(Fixtures!$F$44=\"\",\"\",Fixtures!$F$44)","v":3},{"$f":"IF(Fixtures!$G$44=\"\",\"\",Fixtures!$G$44)","v":2},{"$f":"IF(F43=\"\",\"\",IF(G43=\"\",\"\",IF(F43>G43,\"W\",IF(F43<G43,\"L\",IF(F43=G43,\"D\")))))","v":"W"},{"$f":"IF(Fixtures!$F$56=\"\",\"\",Fixtures!$F$56)","v":""},{"$f":"IF(Fixtures!$G$56=\"\",\"\",Fixtures!$G$56)","v":""},{"$f":"IF(I43=\"\",\"\",IF(J43=\"\",\"\",IF(I43>J43,\"W\",IF(I43<J43,\"L\",IF(I43=J43,\"D\")))))","v":""},{"$f":"IF(Fixtures!$F$35=\"\",\"\",Fixtures!$F$35)","v":0},{"$f":"IF(Fixtures!$G$35=\"\",\"\",Fixtures!$G$35)","v":0},{"$f":"IF(L43=\"\",\"\",IF(M43=\"\",\"\",IF(L43>M43,\"W\",IF(L43<M43,\"L\",IF(L43=M43,\"D\")))))","v":"D"},{"$f":"IF(Fixtures!$F$53=\"\",\"\",Fixtures!$F$53)","v":""},{"$f":"IF(Fixtures!$G$53=\"\",\"\",Fixtures!$G$53)","v":""},{"$f":"IF(O43=\"\",\"\",IF(P43=\"\",\"\",IF(O43>P43,\"W\",IF(O43<P43,\"L\",IF(O43=P43,\"D\")))))","v":""},{"$f":"IF(Fixtures!$F$62=\"\",\"\",Fixtures!$F$62)","v":""},{"$f":"IF(Fixtures!$G$62=\"\",\"\",Fixtures!$G$62)","v":""},{"$f":"IF(R43=\"\",\"\",IF(S43=\"\",\"\",IF(R43>S43,\"W\",IF(R43<S43,\"L\",IF(R43=S43,\"D\")))))","v":""},null,null,{"$f":"SUM(X43:Z43)","v":2},{"$f":"IF(E43=\"W\",1,0)+IF(H43=\"W\",1,0)+IF(K43=\"W\",1,0)+IF(N43=\"W\",1,0)+IF(Q43=\"W\",1,0)+IF(T43=\"W\",1,0)","v":1},{"$f":"IF(E43=\"D\",1,0)+IF(H43=\"D\",1,0)+IF(K43=\"D\",1,0)+IF(N43=\"D\",1,0)+IF(Q43=\"D\",1,0)+IF(T43=\"D\",1,0)","v":1},{"$f":"IF(E43=\"L\",1,0)+IF(H43=\"L\",1,0)+IF(K43=\"L\",1,0)+IF(N43=\"L\",1,0)+IF(Q43=\"L\",1,0)+IF(T43=\"L\",1,0)","v":0},{"$f":"SUM(C43)+SUM(F43)+SUM(I43)+SUM(L43)+SUM(O43)+SUM(R43)","v":3},{"$f":"SUM(D43)+SUM(G43)+SUM(J43)+SUM(M43)+SUM(P43)+SUM(S43)","v":2},{"$f":"AA43-AB43","v":1},{"$f":"X43*3+Y43","v":4},null,{"$f":"SUM(AG43:AI43)","v":2},{"$f":"C49","v":2},{"$f":"D49","v":0},{"$f":"E49","v":0},{"$f":"C50","v":5},{"$f":"D50","v":1},{"$f":"AJ43-AK43","v":4},{"$f":"AG43*3+AH43","v":6},{"$f":"B43","v":"South Korea "},{"$f":"W43+AF43","v":4},{"$f":"X43+AG43","v":3},{"$f":"Y43+AH43","v":1},{"$f":"Z43+AI43","v":0},{"$f":"AA43+AJ43","v":8},{"$f":"AB43+AK43","v":3},{"$f":"AC43+AL43","v":5},{"$f":"AD43+AM43","v":10}]
[null,{"$f":"Fixtures!C36","v":"Iraq "},{"$f":"IF(Fixtures!$F$59=\"\",\"\",Fixtures!$F$59)","v":""},{"$f":"IF(Fixtures!$G$59=\"\",\"\",Fixtures!$G$59)","v":""},{"$f":"IF(C44=\"\",\"\",IF(D44=\"\",\"\",IF(C44>D44,\"W\",IF(C44<D44,\"L\",IF(C44=D44,\"D\")))))","v":""},null,null,{"$f":"IF(F44=\"\",\"\",IF(G44=\"\",\"\",IF(F44>G44,\"W\",IF(F44<G44,\"L\",IF(F44=G44,\"D\")))))","v":""},{"$f":"IF(Fixtures!$F$47=\"\",\"\",Fixtures!$F$47)","v":""},{"$f":"IF(Fixtures!$G$47=\"\",\"\",Fixtures!$G$47)","v":""},{"$f":"IF(I44=\"\",\"\",IF(J44=\"\",\"\",IF(I44>J44,\"W\",IF(I44<J44,\"L\",IF(I44=J44,\"D\")))))","v":""},{"$f":"IF(Fixtures!$F$41=\"\",\"\",Fixtures!$F$41)","v":1},{"$f":"IF(Fixtures!$G$41=\"\",\"\",Fixtures!$G$41)","v":0},{"$f":"IF(L44=\"\",\"\",IF(M44=\"\",\"\",IF(L44>M44,\"W\",IF(L44<M44,\"L\",IF(L44=M44,\"D\")))))","v":"W"},{"$f":"IF(Fixtures!$F$36=\"\",\"\",Fixtures!$F$36)","v":1},{"$f":"IF(Fixtures!$G$36=\"\",\"\",Fixtures!$G$36)","v":0},{"$f":"IF(O44=\"\",\"\",IF(P44=\"\",\"\",IF(O44>P44,\"W\",IF(O44<P44,\"L\",IF(O44=P44,\"D\")))))","v":"W"},{"$f":"IF(Fixtures!$F$54=\"\",\"\",Fixtures!$F$54)","v":""},{"$f":"IF(Fixtures!$G$54=\"\",\"\",Fixtures!$G$54)","v":""},{"$f":"IF(R44=\"\",\"\",IF(S44=\"\",\"\",IF(R44>S44,\"W\",IF(R44<S44,\"L\",IF(R44=S44,\"D\")))))","v":""},null,null,{"$f":"SUM(X44:Z44)","v":2},{"$f":"IF(E44=\"W\",1,0)+IF(H44=\"W\",1,0)+IF(K44=\"W\",1,0)+IF(N44=\"W\",1,0)+IF(Q44=\"W\",1,0)+IF(T44=\"W\",1,0)","v":2},{"$f":"IF(E44=\"D\",1,0)+IF(H44=\"D\",1,0)+IF(K44=\"D\",1,0)+IF(N44=\"D\",1,0)+IF(Q44=\"D\",1,0)+IF(T44=\"D\",1,0)","v":0},{"$f":"IF(E44=\"L\",1,0)+IF(H44=\"L\",1,0)+IF(K44=\"L\",1,0)+IF(N44=\"L\",1,0)+IF(Q44=\"L\",1,0)+IF(T44=\"L\",1,0)","v":0},{"$f":"SUM(C44)+SUM(F44)+SUM(I44)+SUM(L44)+SUM(O44)+SUM(R44)","v":2},{"$f":"SUM(D44)+SUM(G44)+SUM(J44)+SUM(M44)+SUM(P44)+SUM(S44)","v":0},{"$f":"AA44-AB44","v":2},{"$f":"X44*3+Y44","v":6},null,{"$f":"SUM(AG44:AI44)","v":2},{"$f":"F49","v":0},{"$f":"G49","v":1},{"$f":"H49","v":1},{"$f":"F50","v":2},{"$f":"G50","v":3},{"$f":"AJ44-AK44","v":-1},{"$f":"AG44*3+AH44","v":1},{"$f":"B44","v":"Iraq "},{"$f":"W44+AF44","v":4},2,1,1,4,3,1,7]
[null,{"$f":"Fixtures!C37","v":"Jordan "},{"$f":"IF(Fixtures!$F$42=\"\",\"\",Fixtures!$F$42)","v":0},{"$f":"IF(Fixtures!$G$42=\"\",\"\",Fixtures!$G$42)","v":2},"L",{"$f":"IF(Fixtures!$F$63=\"\",\"\",Fixtures!$F$63)","v":""},{"$f":"IF(Fixtures!$G$63=\"\",\"\",Fixtures!$G$63)","v":""},"",null,null,"",{"$f":"IF(Fixtures!$F$55=\"\",\"\",Fixtures!$F$55)","v":""},{"$f":"IF(Fixtures!$G$55=\"\",\"\",Fixtures!$G$55)","v":""},"",{"$f":"IF(Fixtures!$F$45=\"\",\"\",Fixtures!$F$45)","v":4},{"$f":"IF(Fixtures!$G$45=\"\",\"\",Fixtures!$G$45)","v":0},"W",{"$f":"IF(Fixtures!$F$37=\"\",\"\",Fixtures!$F$37)","v":1},{"$f":"IF(Fixtures!$G$37=\"\",\"\",Fixtures!$G$37)","v":1},"D",null,null,3,1,1,1,5,3,2,4,null,1,{"$f":"I49","v":1},{"$f":"J49","v":0},{"$f":"K49","v":0},{"$f":"I50","v":3},{"$f":"J50","v":1},2,3,"Jordan ",4,2,1,1,8,4,4,7]
[null,{"$f":"Fixtures!E35","v":" Palestine"},{"$f":"IF(Fixtures!$F$51=\"\",\"\",Fixtures!$F$51)","v":""},{"$f":"IF(Fixtures!$G$51=\"\",\"\",Fixtures!$G$51)","v":""},"",{"$f":"IF(Fixtures!$F$57=\"\",\"\",Fixtures!$F$57)","v":""},{"$f":"IF(Fixtures!$G$57=\"\",\"\",Fixtures!$G$57)","v":""},"",{"$f":"IF(Fixtures!$F$38=\"\",\"\",Fixtures!$F$38)","v":1},{"$f":"IF(Fixtures!$G$38=\"\",\"\",Fixtures!$G$38)","v":3},"L",null,null,"",{"$f":"IF(Fixtures!$F$64=\"\",\"\",Fixtures!$F$64)","v":""},{"$f":"IF(Fixtures!$G$64=\"\",\"\",Fixtures!$G$64)","v":""},"",{"$f":"IF(Fixtures!$F$46=\"\",\"\",Fixtures!$F$46)","v":2},{"$f":"IF(Fixtures!$G$46=\"\",\"\",Fixtures!$G$46)","v":2},"D",null,null,2,0,1,1,3,5,-2,1,null,2,{"$f":"L49","v":0},{"$f":"M49","v":1},{"$f":"N49","v":1},{"$f":"L50","v":0},{"$f":"M50","v":1},-1,1," Palestine",4,0,2,2,3,6,-3,2]
[null,{"$f":"Fixtures!E36","v":" Oman"},{"$f":"IF(Fixtures!$F$39=\"\",\"\",Fixtures!$F$39)","v":1},{"$f":"IF(Fixtures!$G$39=\"\",\"\",Fixtures!$G$39)","v":3},"L",{"$f":"IF(Fixtures!$F$50=\"\",\"\",Fixtures!$F$50)","v":""},{"$f":"IF(Fixtures!$G$50=\"\",\"\",Fixtures!$G$50)","v":""},"",{"$f":"IF(Fixtures!$F$60=\"\",\"\",Fixtures!$F$60)","v":""},{"$f":"IF(Fixtures!$G$60=\"\",\"\",Fixtures!$G$60)","v":""},"",{"$f":"IF(Fixtures!$F$48=\"\",\"\",Fixtures!$F$48)","v":""},{"$f":"IF(Fixtures!$G$48=\"\",\"\",Fixtures!$G$48)","v":""},"",null,null,"",{"$f":"IF(Fixtures!$F$43=\"\",\"\",Fixtures!$F$43)","v":4},{"$f":"IF(Fixtures!$G$43=\"\",\"\",Fixtures!$G$43)","v":0},"W",null,null,2,{"$f":"IF(E47=\"W\",1,0)+IF(H47=\"W\",1,0)+IF(K47=\"W\",1,0)+IF(N47=\"W\",1,0)+IF(Q47=\"W\",1,0)+IF(T47=\"W\",1,0)","v":1},0,1,5,3,2,3,null,2,{"$f":"O49","v":0},{"$f":"P49","v":0},{"$f":"Q49","v":2},{"$f":"O50","v":0},{"$f":"P50","v":5},-5,0," Oman",4,1,0,3,5,8,-3,3]
[null,{"$f":"Fixtures!E37","v":" Kuwait"},{"$f":"IF(Fixtures!$F$49=\"\",\"\",Fixtures!$F$49)","v":""},{"$f":"IF(Fixtures!$G$49=\"\",\"\",Fixtures!$G$49)","v":""},"",{"$f":"IF(Fixtures!$F$40=\"\",\"\",Fixtures!$F$40)","v":0},{"$f":"IF(Fixtures!$G$40=\"\",\"\",Fixtures!$G$40)","v":0},"D",{"$f":"IF(Fixtures!$F$52=\"\",\"\",Fixtures!$F$52)","v":""},{"$f":"IF(Fixtures!$G$52=\"\",\"\",Fixtures!$G$52)","v":""},"",{"$f":"IF(Fixtures!$F$61=\"\",\"\",Fixtures!$F$61)","v":""},{"$f":"IF(Fixtures!$G$61=\"\",\"\",Fixtures!$G$61)","v":""},"",{"$f":"IF(Fixtures!$F$58=\"\",\"\",Fixtures!$F$58)","v":""},{"$f":"IF(Fixtures!$G$58=\"\",\"\",Fixtures!$G$58)","v":""},"",null,null,"",null,null,1,{"$f":"IF(E48=\"W\",1,0)+IF(H48=\"W\",1,0)+IF(K48=\"W\",1,0)+IF(N48=\"W\",1,0)+IF(Q48=\"W\",1,0)+IF(T48=\"W\",1,0)","v":0},1,0,0,0,0,1,null,3,{"$f":"R49","v":0},{"$f":"S49","v":2},{"$f":"T49","v":1},{"$f":"R50","v":3},{"$f":"S50","v":7},-4,2," Kuwait",4,0,3,1,3,7,-4,3]
[null,"W/D/L",{"$f":"IF(E43=\"L\",1,0)+IF(E44=\"L\",1,0)+IF(E45=\"L\",1,0)+IF(E46=\"L\",1,0)+IF(E47=\"L\",1,0)+IF(E48=\"L\",1,0)","v":2},{"$f":"IF(E43=\"D\",1,0)+IF(E44=\"D\",1,0)+IF(E45=\"D\",1,0)+IF(E46=\"D\",1,0)+IF(E47=\"D\",1,0)+IF(E48=\"D\",1,0)","v":0},{"$f":"IF(E43=\"W\",1,0)+IF(E44=\"W\",1,0)+IF(E45=\"W\",1,0)+IF(E46=\"W\",1,0)+IF(E47=\"W\",1,0)+IF(E48=\"W\",1,0)","v":0},{"$f":"IF(H43=\"L\",1,0)+IF(H44=\"L\",1,0)+IF(H45=\"L\",1,0)+IF(H46=\"L\",1,0)+IF(H47=\"L\",1,0)+IF(H48=\"L\",1,0)","v":0},{"$f":"IF(H43=\"D\",1,0)+IF(H44=\"D\",1,0)+IF(H45=\"D\",1,0)+IF(H46=\"D\",1,0)+IF(H47=\"D\",1,0)+IF(H48=\"D\",1,0)","v":1},{"$f":"IF(H43=\"W\",1,0)+IF(H44=\"W\",1,0)+IF(H45=\"W\",1,0)+IF(H46=\"W\",1,0)+IF(H47=\"W\",1,0)+IF(H48=\"W\",1,0)","v":1},{"$f":"IF(K43=\"L\",1,0)+IF(K44=\"L\",1,0)+IF(K45=\"L\",1,0)+IF(K46=\"L\",1,0)+IF(K47=\"L\",1,0)+IF(K48=\"L\",1,0)","v":1},{"$f":"IF(K43=\"D\",1,0)+IF(K44=\"D\",1,0)+IF(K45=\"D\",1,0)+IF(K46=\"D\",1,0)+IF(K47=\"D\",1,0)+IF(K48=\"D\",1,0)","v":0},{"$f":"IF(K43=\"W\",1,0)+IF(K44=\"W\",1,0)+IF(K45=\"W\",1,0)+IF(K46=\"W\",1,0)+IF(K47=\"W\",1,0)+IF(K48=\"W\",1,0)","v":0},{"$f":"IF(N43=\"L\",1,0)+IF(N44=\"L\",1,0)+IF(N45=\"L\",1,0)+IF(N46=\"L\",1,0)+IF(N47=\"L\",1,0)+IF(N48=\"L\",1,0)","v":0},{"$f":"IF(N43=\"D\",1,0)+IF(N44=\"D\",1,0)+IF(N45=\"D\",1,0)+IF(N46=\"D\",1,0)+IF(N47=\"D\",1,0)+IF(N48=\"D\",1,0)","v":1},{"$f":"IF(N43=\"W\",1,0)+IF(N44=\"W\",1,0)+IF(N45=\"W\",1,0)+IF(N46=\"W\",1,0)+IF(N47=\"W\",1,0)+IF(N48=\"W\",1,0)","v":1},{"$f":"IF(Q43=\"L\",1,0)+IF(Q44=\"L\",1,0)+IF(Q45=\"L\",1,0)+IF(Q46=\"L\",1,0)+IF(Q47=\"L\",1,0)+IF(Q48=\"L\",1,0)","v":0},{"$f":"IF(Q43=\"D\",1,0)+IF(Q44=\"D\",1,0)+IF(Q45=\"D\",1,0)+IF(Q46=\"D\",1,0)+IF(Q47=\"D\",1,0)+IF(Q48=\"D\",1,0)","v":0},{"$f":"IF(Q43=\"W\",1,0)+IF(Q44=\"W\",1,0)+IF(Q45=\"W\",1,0)+IF(Q46=\"W\",1,0)+IF(Q47=\"W\",1,0)+IF(Q48=\"W\",1,0)","v":2},{"$f":"IF(T43=\"L\",1,0)+IF(T44=\"L\",1,0)+IF(T45=\"L\",1,0)+IF(T46=\"L\",1,0)+IF(T47=\"L\",1,0)+IF(T48=\"L\",1,0)","v":0},{"$f":"IF(T43=\"D\",1,0)+IF(T44=\"D\",1,0)+IF(T45=\"D\",1,0)+IF(T46=\"D\",1,0)+IF(T47=\"D\",1,0)+IF(T48=\"D\",1,0)","v":2},{"$f":"IF(T43=\"W\",1,0)+IF(T44=\"W\",1,0)+IF(T45=\"W\",1,0)+IF(T46=\"W\",1,0)+IF(T47=\"W\",1,0)+IF(T48=\"W\",1,0)","v":1}]
[null,"F/A",{"$f":"SUM(D43:D48)","v":5},{"$f":"SUM(C43:C48)","v":1},null,{"$f":"SUM(G43:G48)","v":2},{"$f":"SUM(F43:F48)","v":3},null,{"$f":"SUM(J43:J48)","v":3},{"$f":"SUM(I43:I48)","v":1},null,{"$f":"SUM(M43:M48)","v":0},{"$f":"SUM(L43:L48)","v":1},null,{"$f":"SUM(P43:P48)","v":0},{"$f":"SUM(O43:O48)","v":5},null,{"$f":"SUM(S43:S48)","v":3},{"$f":"SUM(R43:R48)","v":7}]
[null,null,null,{"$f":"IF(Fixtures!$F$34=\"\",\"\",Fixtures!$F$34)","v":""},{"$f":"IF(Fixtures!$G$34=\"\",\"\",Fixtures!$G$34)","v":""}]
[null,"Group C",null,{"$f":"B53","v":"Japan "},null,null,{"$f":"B54","v":"Australia "},null,null,{"$f":"B55","v":"Saudi Arabia "},null,null,{"$f":"B56","v":" China"},null,null,{"$f":"B57","v":" Bahrain"},null,null,{"$f":"B58","v":" Indonesia"},null,null,null,"P","W","D","L","F","A","G/D","Pts",null,"P","W","D","L","F","A","G/D","Pts",{"$f":"IF(SUM(AO53:AO58)=60,\"Group Completed\",\"Group Incomplete\")","v":"Group Incomplete"},"P","W","D","L","F","A","G/D","Pts"]
[null,{"$f":"Fixtures!C4","v":"Japan "},null,null,{"$f":"IF(C53=\"\",\"\",IF(D53=\"\",\"\",IF(C53>D53,\"W\",IF(C53<D53,\"L\",IF(C53=D53,\"D\")))))","v":""},{"$f":"IF(Fixtures!$F$13=\"\",\"\",Fixtures!$F$13)","v":1},{"$f":"IF(Fixtures!$G$13=\"\",\"\",Fixtures!$G$13)","v":1},{"$f":"IF(F53=\"\",\"\",IF(G53=\"\",\"\",IF(F53>G53,\"W\",IF(F53<G53,\"L\",IF(F53=G53,\"D\")))))","v":"D"},{"$f":"IF(Fixtures!$F$25=\"\",\"\",Fixtures!$F$25)","v":""},{"$f":"IF(Fixtures!$G$25=\"\",\"\",Fixtures!$G$25)","v":""},{"$f":"IF(I53=\"\",\"\",IF(J53=\"\",\"\",IF(I53>J53,\"W\",IF(I53<J53,\"L\",IF(I53=J53,\"D\")))))","v":""},{"$f":"IF(Fixtures!$F$4=\"\",\"\",Fixtures!$F$4)","v":7},{"$f":"IF(Fixtures!$G$4=\"\",\"\",Fixtures!$G$4)","v":0},{"$f":"IF(L53=\"\",\"\",IF(M53=\"\",\"\",IF(L53>M53,\"W\",IF(L53<M53,\"L\",IF(L53=M53,\"D\")))))","v":"W"},{"$f":"IF(Fixtures!$F$22=\"\",\"\",Fixtures!$F$22)","v":""},{"$f":"IF(Fixtures!$G$22=\"\",\"\",Fixtures!$G$22)","v":""},{"$f":"IF(O53=\"\",\"\",IF(P53=\"\",\"\",IF(O53>P53,\"W\",IF(O53<P53,\"L\",IF(O53=P53,\"D\")))))","v":""},{"$f":"IF(Fixtures!$F$31=\"\",\"\",Fixtures!$F$31)","v":""},{"$f":"IF(Fixtures!$G$31=\"\",\"\",Fixtures!$G$31)","v":""},{"$f":"IF(R53=\"\",\"\",IF(S53=\"\",\"\",IF(R53>S53,\"W\",IF(R53<S53,\"L\",IF(R53=S53,\"D\")))))","v":""},null,null,{"$f":"SUM(X53:Z53)","v":2},{"$f":"IF(E53=\"W\",1,0)+IF(H53=\"W\",1,0)+IF(K53=\"W\",1,0)+IF(N53=\"W\",1,0)+IF(Q53=\"W\",1,0)+IF(T53=\"W\",1,0)","v":1},{"$f":"IF(E53=\"D\",1,0)+IF(H53=\"D\",1,0)+IF(K53=\"D\",1,0)+IF(N53=\"D\",1,0)+IF(Q53=\"D\",1,0)+IF(T53=\"D\",1,0)","v":1},{"$f":"IF(E53=\"L\",1,0)+IF(H53=\"L\",1,0)+IF(K53=\"L\",1,0)+IF(N53=\"L\",1,0)+IF(Q53=\"L\",1,0)+IF(T53=\"L\",1,0)","v":0},{"$f":"SUM(C53)+SUM(F53)+SUM(I53)+SUM(L53)+SUM(O53)+SUM(R53)","v":8},{"$f":"SUM(D53)+SUM(G53)+SUM(J53)+SUM(M53)+SUM(P53)+SUM(S53)","v":1},{"$f":"AA53-AB53","v":7},{"$f":"X53*3+Y53","v":4},null,{"$f":"SUM(AG53:AI53)","v":2},{"$f":"C59","v":2},{"$f":"D59","v":0},{"$f":"E59","v":0},{"$f":"C60","v":7},{"$f":"D60","v":0},{"$f":"AJ53-AK53","v":7},{"$f":"AG53*3+AH53","v":6},{"$f":"B53","v":"Japan "},{"$f":"W53+AF53","v":4},{"$f":"X53+AG53","v":3},1,0,15,1,14,10]
[null,{"$f":"Fixtures!C5","v":"Australia "},{"$f":"IF(Fixtures!$F$28=\"\",\"\",Fixtures!$F$28)","v":""},{"$f":"IF(Fixtures!$G$28=\"\",\"\",Fixtures!$G$28)","v":""},{"$f":"IF(C54=\"\",\"\",IF(D54=\"\",\"\",IF(C54>D54,\"W\",IF(C54<D54,\"L\",IF(C54=D54,\"D\")))))","v":""},null,null,{"$f":"IF(F54=\"\",\"\",IF(G54=\"\",\"\",IF(F54>G54,\"W\",IF(F54<G54,\"L\",IF(F54=G54,\"D\")))))","v":""},{"$f":"IF(Fixtures!$F$16=\"\",\"\",Fixtures!$F$16)","v":""},{"$f":"IF(Fixtures!$G$16=\"\",\"\",Fixtures!$G$16)","v":""},{"$f":"IF(I54=\"\",\"\",IF(J54=\"\",\"\",IF(I54>J54,\"W\",IF(I54<J54,\"L\",IF(I54=J54,\"D\")))))","v":""},{"$f":"IF(Fixtures!$F$10=\"\",\"\",Fixtures!$F$10)","v":3},{"$f":"IF(Fixtures!$G$10=\"\",\"\",Fixtures!$G$10)","v":1},{"$f":"IF(L54=\"\",\"\",IF(M54=\"\",\"\",IF(L54>M54,\"W\",IF(L54<M54,\"L\",IF(L54=M54,\"D\")))))","v":"W"},{"$f":"IF(Fixtures!$F$5=\"\",\"\",Fixtures!$F$5)","v":0},{"$f":"IF(Fixtures!$G$5=\"\",\"\",Fixtures!$G$5)","v":1},{"$f":"IF(O54=\"\",\"\",IF(P54=\"\",\"\",IF(O54>P54,\"W\",IF(O54<P54,\"L\",IF(O54=P54,\"D\")))))","v":"L"},{"$f":"IF(Fixtures!$F$23=\"\",\"\",Fixtures!$F$23)","v":""},{"$f":"IF(Fixtures!$G$23=\"\",\"\",Fixtures!$G$23)","v":""},{"$f":"IF(R54=\"\",\"\",IF(S54=\"\",\"\",IF(R54>S54,\"W\",IF(R54<S54,\"L\",IF(R54=S54,\"D\")))))","v":""},null,null,{"$f":"SUM(X54:Z54)","v":2},{"$f":"IF(E54=\"W\",1,0)+IF(H54=\"W\",1,0)+IF(K54=\"W\",1,0)+IF(N54=\"W\",1,0)+IF(Q54=\"W\",1,0)+IF(T54=\"W\",1,0)","v":1},{"$f":"IF(E54=\"D\",1,0)+IF(H54=\"D\",1,0)+IF(K54=\"D\",1,0)+IF(N54=\"D\",1,0)+IF(Q54=\"D\",1,0)+IF(T54=\"D\",1,0)","v":0},{"$f":"IF(E54=\"L\",1,0)+IF(H54=\"L\",1,0)+IF(K54=\"L\",1,0)+IF(N54=\"L\",1,0)+IF(Q54=\"L\",1,0)+IF(T54=\"L\",1,0)","v":1},{"$f":"SUM(C54)+SUM(F54)+SUM(I54)+SUM(L54)+SUM(O54)+SUM(R54)","v":3},{"$f":"SUM(D54)+SUM(G54)+SUM(J54)+SUM(M54)+SUM(P54)+SUM(S54)","v":2},{"$f":"AA54-AB54","v":1},{"$f":"X54*3+Y54","v":3},null,{"$f":"SUM(AG54:AI54)","v":2},{"$f":"F59","v":0},{"$f":"G59","v":2},{"$f":"H59","v":0},{"$f":"F60","v":1},{"$f":"G60","v":1},{"$f":"AJ54-AK54","v":0},{"$f":"AG54*3+AH54","v":2},{"$f":"B54","v":"Australia "},{"$f":"W54+AF54","v":4},1,2,1,4,3,1,5]
[null,{"$f":"Fixtures!C6","v":"Saudi Arabia "},{"$f":"IF(Fixtures!$F$11=\"\",\"\",Fixtures!$F$11)","v":0},{"$f":"IF(Fixtures!$G$11=\"\",\"\",Fixtures!$G$11)","v":2},"L",{"$f":"IF(Fixtures!$F$32=\"\",\"\",Fixtures!$F$32)","v":""},{"$f":"IF(Fixtures!$G$32=\"\",\"\",Fixtures!$G$32)","v":""},"",null,null,"",{"$f":"IF(Fixtures!$F$24=\"\",\"\",Fixtures!$F$24)","v":""},{"$f":"IF(Fixtures!$G$24=\"\",\"\",Fixtures!$G$24)","v":""},"",{"$f":"IF(Fixtures!$F$14=\"\",\"\",Fixtures!$F$14)","v":0},{"$f":"IF(Fixtures!$G$14=\"\",\"\",Fixtures!$G$14)","v":0},"D",{"$f":"IF(Fixtures!$F$6=\"\",\"\",Fixtures!$F$6)","v":1},{"$f":"IF(Fixtures!$G$6=\"\",\"\",Fixtures!$G$6)","v":1},"D",null,null,3,0,2,1,1,3,-2,2,null,1,{"$f":"I59","v":1},{"$f":"J59","v":0},{"$f":"K59","v":0},{"$f":"I60","v":2},{"$f":"J60","v":1},1,3,"Saudi Arabia ",4,1,2,1,3,4,-1,5]
[null,{"$f":"Fixtures!E4","v":" China"},{"$f":"IF(Fixtures!$F$20=\"\",\"\",Fixtures!$F$20)","v":""},{"$f":"IF(Fixtures!$G$20=\"\",\"\",Fixtures!$G$20)","v":""},"",{"$f":"IF(Fixtures!$F$26=\"\",\"\",Fixtures!$F$26)","v":""},{"$f":"IF(Fixtures!$G$26=\"\",\"\",Fixtures!$G$26)","v":""},"",{"$f":"IF(Fixtures!$F$8=\"\",\"\",Fixtures!$F$8)","v":1},{"$f":"IF(Fixtures!$G$8=\"\",\"\",Fixtures!$G$8)","v":2},"L",null,null,"",{"$f":"IF(Fixtures!$F$33=\"\",\"\",Fixtures!$F$33)","v":""},{"$f":"IF(Fixtures!$G$33=\"\",\"\",Fixtures!$G$33)","v":""},"",{"$f":"IF(Fixtures!$F$15=\"\",\"\",Fixtures!$F$15)","v":2},{"$f":"IF(Fixtures!$G$15=\"\",\"\",Fixtures!$G$15)","v":1},"W",null,null,2,1,0,1,3,3,0,3,null,2,{"$f":"L59","v":0},{"$f":"M59","v":0},{"$f":"N59","v":2},{"$f":"L60","v":1},{"$f":"M60","v":10},-9,0," China",4,1,0,3,4,13,-9,3]
[null,{"$f":"Fixtures!E5","v":" Bahrain"},{"$f":"IF(Fixtures!$F$7=\"\",\"\",Fixtures!$F$7)","v":0},{"$f":"IF(Fixtures!$G$7=\"\",\"\",Fixtures!$G$7)","v":5},"L",{"$f":"IF(Fixtures!$F$19=\"\",\"\",Fixtures!$F$19)","v":""},{"$f":"IF(Fixtures!$G$19=\"\",\"\",Fixtures!$G$19)","v":""},"",{"$f":"IF(Fixtures!$F$29=\"\",\"\",Fixtures!$F$29)","v":""},{"$f":"IF(Fixtures!$G$29=\"\",\"\",Fixtures!$G$29)","v":""},"",{"$f":"IF(Fixtures!$F$17=\"\",\"\",Fixtures!$F$17)","v":""},{"$f":"IF(Fixtures!$G$17=\"\",\"\",Fixtures!$G$17)","v":""},"",null,null,"",{"$f":"IF(Fixtures!$F$12=\"\",\"\",Fixtures!$F$12)","v":2},{"$f":"IF(Fixtures!$G$12=\"\",\"\",Fixtures!$G$12)","v":2},"D",null,null,2,{"$f":"IF(E57=\"W\",1,0)+IF(H57=\"W\",1,0)+IF(K57=\"W\",1,0)+IF(N57=\"W\",1,0)+IF(Q57=\"W\",1,0)+IF(T57=\"W\",1,0)","v":0},1,1,2,7,-5,1,null,2,{"$f":"O59","v":1},{"$f":"P59","v":1},{"$f":"Q59","v":0},{"$f":"O60","v":1},{"$f":"P60","v":0},1,4," Bahrain",4,1,2,1,3,7,-4,5]
[null,{"$f":"Fixtures!E6","v":" Indonesia"},{"$f":"IF(Fixtures!$F$18=\"\",\"\",Fixtures!$F$18)","v":""},{"$f":"IF(Fixtures!$G$18=\"\",\"\",Fixtures!$G$18)","v":""},"",{"$f":"IF(Fixtures!$F$9=\"\",\"\",Fixtures!$F$9)","v":0},{"$f":"IF(Fixtures!$G$9=\"\",\"\",Fixtures!$G$9)","v":0},"D",{"$f":"IF(Fixtures!$F$21=\"\",\"\",Fixtures!$F$21)","v":""},{"$f":"IF(Fixtures!$G$21=\"\",\"\",Fixtures!$G$21)","v":""},"",{"$f":"IF(Fixtures!$F$30=\"\",\"\",Fixtures!$F$30)","v":""},{"$f":"IF(Fixtures!$G$30=\"\",\"\",Fixtures!$G$30)","v":""},"",{"$f":"IF(Fixtures!$F$27=\"\",\"\",Fixtures!$F$27)","v":""},{"$f":"IF(Fixtures!$G$27=\"\",\"\",Fixtures!$G$27)","v":""},"",null,null,"",null,null,{"$f":"SUM(X58:Z58)","v":1},{"$f":"IF(E58=\"W\",1,0)+IF(H58=\"W\",1,0)+IF(K58=\"W\",1,0)+IF(N58=\"W\",1,0)+IF(Q58=\"W\",1,0)+IF(T58=\"W\",1,0)","v":0},{"$f":"IF(E58=\"D\",1,0)+IF(H58=\"D\",1,0)+IF(K58=\"D\",1,0)+IF(N58=\"D\",1,0)+IF(Q58=\"D\",1,0)+IF(T58=\"D\",1,0)","v":1},{"$f":"IF(E58=\"L\",1,0)+IF(H58=\"L\",1,0)+IF(K58=\"L\",1,0)+IF(N58=\"L\",1,0)+IF(Q58=\"L\",1,0)+IF(T58=\"L\",1,0)","v":0},{"$f":"SUM(C58)+SUM(F58)+SUM(I58)+SUM(L58)+SUM(O58)+SUM(R58)","v":0},{"$f":"SUM(D58)+SUM(G58)+SUM(J58)+SUM(M58)+SUM(P58)+SUM(S58)","v":0},{"$f":"AA58-AB58","v":0},{"$f":"X58*3+Y58","v":1},null,3,{"$f":"R59","v":0},{"$f":"S59","v":2},{"$f":"T59","v":1},{"$f":"R60","v":4},{"$f":"S60","v":5},-1,2," Indonesia",4,0,3,1,4,5,-1,3]
[null,"W/D/L",{"$f":"IF(E53=\"L\",1,0)+IF(E54=\"L\",1,0)+IF(E55=\"L\",1,0)+IF(E56=\"L\",1,0)+IF(E57=\"L\",1,0)+IF(E58=\"L\",1,0)","v":2},{"$f":"IF(E53=\"D\",1,0)+IF(E54=\"D\",1,0)+IF(E55=\"D\",1,0)+IF(E56=\"D\",1,0)+IF(E57=\"D\",1,0)+IF(E58=\"D\",1,0)","v":0},{"$f":"IF(E53=\"W\",1,0)+IF(E54=\"W\",1,0)+IF(E55=\"W\",1,0)+IF(E56=\"W\",1,0)+IF(E57=\"W\",1,0)+IF(E58=\"W\",1,0)","v":0},{"$f":"IF(H53=\"L\",1,0)+IF(H54=\"L\",1,0)+IF(H55=\"L\",1,0)+IF(H56=\"L\",1,0)+IF(H57=\"L\",1,0)+IF(H58=\"L\",1,0)","v":0},{"$f":"IF(H53=\"D\",1,0)+IF(H54=\"D\",1,0)+IF(H55=\"D\",1,0)+IF(H56=\"D\",1,0)+IF(H57=\"D\",1,0)+IF(H58=\"D\",1,0)","v":2},{"$f":"IF(H53=\"W\",1,0)+IF(H54=\"W\",1,0)+IF(H55=\"W\",1,0)+IF(H56=\"W\",1,0)+IF(H57=\"W\",1,0)+IF(H58=\"W\",1,0)","v":0},{"$f":"IF(K53=\"L\",1,0)+IF(K54=\"L\",1,0)+IF(K55=\"L\",1,0)+IF(K56=\"L\",1,0)+IF(K57=\"L\",1,0)+IF(K58=\"L\",1,0)","v":1},{"$f":"IF(K53=\"D\",1,0)+IF(K54=\"D\",1,0)+IF(K55=\"D\",1,0)+IF(K56=\"D\",1,0)+IF(K57=\"D\",1,0)+IF(K58=\"D\",1,0)","v":0},{"$f":"IF(K53=\"W\",1,0)+IF(K54=\"W\",1,0)+IF(K55=\"W\",1,0)+IF(K56=\"W\",1,0)+IF(K57=\"W\",1,0)+IF(K58=\"W\",1,0)","v":0},{"$f":"IF(N53=\"L\",1,0)+IF(N54=\"L\",1,0)+IF(N55=\"L\",1,0)+IF(N56=\"L\",1,0)+IF(N57=\"L\",1,0)+IF(N58=\"L\",1,0)","v":0},{"$f":"IF(N53=\"D\",1,0)+IF(N54=\"D\",1,0)+IF(N55=\"D\",1,0)+IF(N56=\"D\",1,0)+IF(N57=\"D\",1,0)+IF(N58=\"D\",1,0)","v":0},{"$f":"IF(N53=\"W\",1,0)+IF(N54=\"W\",1,0)+IF(N55=\"W\",1,0)+IF(N56=\"W\",1,0)+IF(N57=\"W\",1,0)+IF(N58=\"W\",1,0)","v":2},{"$f":"IF(Q53=\"L\",1,0)+IF(Q54=\"L\",1,0)+IF(Q55=\"L\",1,0)+IF(Q56=\"L\",1,0)+IF(Q57=\"L\",1,0)+IF(Q58=\"L\",1,0)","v":1},{"$f":"IF(Q53=\"D\",1,0)+IF(Q54=\"D\",1,0)+IF(Q55=\"D\",1,0)+IF(Q56=\"D\",1,0)+IF(Q57=\"D\",1,0)+IF(Q58=\"D\",1,0)","v":1},{"$f":"IF(Q53=\"W\",1,0)+IF(Q54=\"W\",1,0)+IF(Q55=\"W\",1,0)+IF(Q56=\"W\",1,0)+IF(Q57=\"W\",1,0)+IF(Q58=\"W\",1,0)","v":0},{"$f":"IF(T53=\"L\",1,0)+IF(T54=\"L\",1,0)+IF(T55=\"L\",1,0)+IF(T56=\"L\",1,0)+IF(T57=\"L\",1,0)+IF(T58=\"L\",1,0)","v":0},{"$f":"IF(T53=\"D\",1,0)+IF(T54=\"D\",1,0)+IF(T55=\"D\",1,0)+IF(T56=\"D\",1,0)+IF(T57=\"D\",1,0)+IF(T58=\"D\",1,0)","v":2},{"$f":"IF(T53=\"W\",1,0)+IF(T54=\"W\",1,0)+IF(T55=\"W\",1,0)+IF(T56=\"W\",1,0)+IF(T57=\"W\",1,0)+IF(T58=\"W\",1,0)","v":1}]
[null,"F/A",{"$f":"SUM(D53:D58)","v":7},{"$f":"SUM(C53:C58)","v":0},null,{"$f":"SUM(G53:G58)","v":1},{"$f":"SUM(F53:F58)","v":1},null,{"$f":"SUM(J53:J58)","v":2},{"$f":"SUM(I53:I58)","v":1},null,{"$f":"SUM(M53:M58)","v":1},{"$f":"SUM(L53:L58)","v":10},null,{"$f":"SUM(P53:P58)","v":1},{"$f":"SUM(O53:O58)","v":0},null,{"$f":"SUM(S53:S58)","v":4},{"$f":"SUM(R53:R58)","v":5}]

{"sheet":"McRopod","index":2,"n_rows":19,"n_cols":2,"rows_kept":19,"cut":false,"hidden":false,"merged":[]}
[]
[]
[null,"Welcome to the McRopod Concepts Sports System for the Stage 3 AFC World Cup 2026 Qualifiers."]
[]
[null,"You can enter a real or predicted result in the yellow cells next to a fixture shown on the Fixtures page."]
[null,"When you do that, you can then sort the relevant Group Ladder to see the effect this has on those teams'"]
[null,"paths to qualification."]
[]
[null,"Once all the reults have been input and a Group Ladder is complete, you'll see which two teams have"]
[null,"already qualified, which have to go to Stage 4 to qualify; and which two teams from that Group"]
[null,"have been eliminated."]
[]
[null,"All without having to do any calculations or sorting of your own - and all without any maths errors!"]
[]
[null,"So go to the Fixtures page and enjoy the tournament."]
[]
[]
[null,"Alan Clark"]
[null,"McRopod Concepts"]

{"sheet":"LaddersH","index":3,"n_rows":58,"n_cols":10,"rows_kept":58,"cut":false,"hidden":false,"merged":[]}
[]
[]
[]
[]
[]
[]
[]
[]
[]
[]
[]
[]
[]
[]
[]
[]
[]
[]
[]
[]
[]
[]
[]
[]
[]
[]
[]
[]
[]
[]
[]
[null,{"$f":"Grid!AN32","v":"Group Incomplete"},{"$f":"Grid!AO32","v":"P"},{"$f":"Grid!AP32","v":"W"},{"$f":"Grid!AQ32","v":"D"},{"$f":"Grid!AR32","v":"L"},{"$f":"Grid!AS32","v":"F"},{"$f":"Grid!AT32","v":"A"},{"$f":"Grid!AU32","v":"G/D"},{"$f":"Grid!AV32","v":"Pts"}]
[null,{"$f":"Grid!AN34","v":"Iran "},{"$f":"Grid!AO34","v":4},{"$f":"Grid!AP34","v":3},{"$f":"Grid!AQ34","v":1},{"$f":"Grid!AR34","v":0},{"$f":"Grid!AS34","v":6},{"$f":"Grid!AT34","v":1},{"$f":"Grid!AU34","v":5},{"$f":"Grid!AV34","v":10}]
[null,{"$f":"Grid!AN33","v":"Uzbekistan "},{"$f":"Grid!AO33","v":4},{"$f":"Grid!AP33","v":3},{"$f":"Grid!AQ33","v":1},{"$f":"Grid!AR33","v":0},{"$f":"Grid!AS33","v":5},{"$f":"Grid!AT33","v":2},{"$f":"Grid!AU33","v":3},{"$f":"Grid!AV33","v":10}]
[null,{"$f":"Grid!AN38","v":" United Arab Emirates"},{"$f":"Grid!AO38","v":4},{"$f":"Grid!AP38","v":1},{"$f":"Grid!AQ38","v":1},{"$f":"Grid!AR38","v":2},{"$f":"Grid!AS38","v":4},{"$f":"Grid!AT38","v":4},{"$f":"Grid!AU38","v":0},{"$f":"Grid!AV38","v":4}]
[null,{"$f":"Grid!AN35","v":"Qatar "},{"$f":"Grid!AO35","v":4},{"$f":"Grid!AP35","v":1},{"$f":"Grid!AQ35","v":1},{"$f":"Grid!AR35","v":2},{"$f":"Grid!AS35","v":7},{"$f":"Grid!AT35","v":10},{"$f":"Grid!AU35","v":-3},{"$f":"Grid!AV35","v":4}]
[null,{"$f":"Grid!AN37","v":" Kyrgyzstan"},{"$f":"Grid!AO37","v":4},{"$f":"Grid!AP37","v":1},{"$f":"Grid!AQ37","v":0},{"$f":"Grid!AR37","v":3},{"$f":"Grid!AS37","v":4},{"$f":"Grid!AT37","v":7},{"$f":"Grid!AU37","v":-3},{"$f":"Grid!AV37","v":3}]
[null,{"$f":"Grid!AN36","v":" North Korea"},{"$f":"Grid!AO36","v":4},{"$f":"Grid!AP36","v":0},{"$f":"Grid!AQ36","v":2},{"$f":"Grid!AR36","v":2},{"$f":"Grid!AS36","v":3},{"$f":"Grid!AT36","v":5},{"$f":"Grid!AU36","v":-2},{"$f":"Grid!AV36","v":2}]
[]
[]
[]
[null,{"$f":"Grid!AN42","v":"Group Incomplete"},{"$f":"Grid!AO42","v":"P"},{"$f":"Grid!AP42","v":"W"},{"$f":"Grid!AQ42","v":"D"},{"$f":"Grid!AR42","v":"L"},{"$f":"Grid!AS42","v":"F"},{"$f":"Grid!AT42","v":"A"},{"$f":"Grid!AU42","v":"G/D"},{"$f":"Grid!AV42","v":"Pts"}]
[null,{"$f":"Grid!AN43","v":"South Korea "},{"$f":"Grid!AO43","v":4},{"$f":"Grid!AP43","v":3},{"$f":"Grid!AQ43","v":1},{"$f":"Grid!AR43","v":0},{"$f":"Grid!AS43","v":8},{"$f":"Grid!AT43","v":3},{"$f":"Grid!AU43","v":5},{"$f":"Grid!AV43","v":10}]
[null,{"$f":"Grid!AN45","v":"Jordan "},{"$f":"Grid!AO45","v":4},{"$f":"Grid!AP45","v":2},{"$f":"Grid!AQ45","v":1},{"$f":"Grid!AR45","v":1},{"$f":"Grid!AS45","v":8},{"$f":"Grid!AT45","v":4},{"$f":"Grid!AU45","v":4},{"$f":"Grid!AV45","v":7}]
[null,{"$f":"Grid!AN44","v":"Iraq "},{"$f":"Grid!AO44","v":4},{"$f":"Grid!AP44","v":2},{"$f":"Grid!AQ44","v":1},{"$f":"Grid!AR44","v":1},{"$f":"Grid!AS44","v":4},{"$f":"Grid!AT44","v":3},{"$f":"Grid!AU44","v":1},{"$f":"Grid!AV44","v":7}]
[null,{"$f":"Grid!AN47","v":" Oman"},{"$f":"Grid!AO47","v":4},{"$f":"Grid!AP47","v":1},{"$f":"Grid!AQ47","v":0},{"$f":"Grid!AR47","v":3},{"$f":"Grid!AS47","v":5},{"$f":"Grid!AT47","v":8},{"$f":"Grid!AU47","v":-3},{"$f":"Grid!AV47","v":3}]
[null,{"$f":"Grid!AN48","v":" Kuwait"},{"$f":"Grid!AO48","v":4},{"$f":"Grid!AP48","v":0},{"$f":"Grid!AQ48","v":3},{"$f":"Grid!AR48","v":1},{"$f":"Grid!AS48","v":3},{"$f":"Grid!AT48","v":7},{"$f":"Grid!AU48","v":-4},{"$f":"Grid!AV48","v":3}]
[null,{"$f":"Grid!AN46","v":" Palestine"},{"$f":"Grid!AO46","v":4},{"$f":"Grid!AP46","v":0},{"$f":"Grid!AQ46","v":2},{"$f":"Grid!AR46","v":2},{"$f":"Grid!AS46","v":3},{"$f":"Grid!AT46","v":6},{"$f":"Grid!AU46","v":-3},{"$f":"Grid!AV46","v":2}]
[]
[]
[]
[null,{"$f":"Grid!AN52","v":"Group Incomplete"},{"$f":"Grid!AO52","v":"P"},{"$f":"Grid!AP52","v":"W"},{"$f":"Grid!AQ52","v":"D"},{"$f":"Grid!AR52","v":"L"},{"$f":"Grid!AS52","v":"F"},{"$f":"Grid!AT52","v":"A"},{"$f":"Grid!AU52","v":"G/D"},{"$f":"Grid!AV52","v":"Pts"}]
[null,{"$f":"Grid!AN53","v":"Japan "},{"$f":"Grid!AO53","v":4},{"$f":"Grid!AP53","v":3},{"$f":"Grid!AQ53","v":1},{"$f":"Grid!AR53","v":0},{"$f":"Grid!AS53","v":15},{"$f":"Grid!AT53","v":1},{"$f":"Grid!AU53","v":14},{"$f":"Grid!AV53","v":10}]
[null,{"$f":"Grid!AN54","v":"Australia "},{"$f":"Grid!AO54","v":4},{"$f":"Grid!AP54","v":1},{"$f":"Grid!AQ54","v":2},{"$f":"Grid!AR54","v":1},{"$f":"Grid!AS54","v":4},{"$f":"Grid!AT54","v":3},{"$f":"Grid!AU54","v":1},{"$f":"Grid!AV54","v":5}]
[null,{"$f":"Grid!AN55","v":"Saudi Arabia "},{"$f":"Grid!AO55","v":4},{"$f":"Grid!AP55","v":1},{"$f":"Grid!AQ55","v":2},{"$f":"Grid!AR55","v":1},{"$f":"Grid!AS55","v":3},{"$f":"Grid!AT55","v":4},{"$f":"Grid!AU55","v":-1},{"$f":"Grid!AV55","v":5}]
[null,{"$f":"Grid!AN57","v":" Bahrain"},{"$f":"Grid!AO57","v":4},{"$f":"Grid!AP57","v":1},{"$f":"Grid!AQ57","v":2},{"$f":"Grid!AR57","v":1},{"$f":"Grid!AS57","v":3},{"$f":"Grid!AT57","v":7},{"$f":"Grid!AU57","v":-4},{"$f":"Grid!AV57","v":5}]
[null,{"$f":"Grid!AN58","v":" Indonesia"},{"$f":"Grid!AO58","v":4},{"$f":"Grid!AP58","v":0},{"$f":"Grid!AQ58","v":3},{"$f":"Grid!AR58","v":1},{"$f":"Grid!AS58","v":4},{"$f":"Grid!AT58","v":5},{"$f":"Grid!AU58","v":-1},{"$f":"Grid!AV58","v":3}]
[null,{"$f":"Grid!AN56","v":" China"},{"$f":"Grid!AO56","v":4},{"$f":"Grid!AP56","v":1},{"$f":"Grid!AQ56","v":0},{"$f":"Grid!AR56","v":3},{"$f":"Grid!AS56","v":4},{"$f":"Grid!AT56","v":13},{"$f":"Grid!AU56","v":-9},{"$f":"Grid!AV56","v":3}]

{"sheet":"Ladders","index":4,"n_rows":27,"n_cols":12,"rows_kept":27,"cut":false,"hidden":false,"merged":[]}
[]
[]
[null,null,{"$f":"LaddersH!B32","v":"Group Incomplete"},{"$f":"LaddersH!C32","v":"P"},{"$f":"LaddersH!D32","v":"W"},{"$f":"LaddersH!E32","v":"D"},{"$f":"LaddersH!F32","v":"L"},{"$f":"LaddersH!G32","v":"F"},{"$f":"LaddersH!H32","v":"A"},{"$f":"LaddersH!I32","v":"G/D"},{"$f":"LaddersH!J32","v":"Pts"}]
[null,null,{"$f":"LaddersH!B33","v":"Iran "},{"$f":"LaddersH!C33","v":4},{"$f":"LaddersH!D33","v":3},{"$f":"LaddersH!E33","v":1},{"$f":"LaddersH!F33","v":0},{"$f":"LaddersH!G33","v":6},{"$f":"LaddersH!H33","v":1},{"$f":"LaddersH!I33","v":5},{"$f":"LaddersH!J33","v":10},"  Qualified WC 26"]
[null,null,{"$f":"LaddersH!B34","v":"Uzbekistan "},{"$f":"LaddersH!C34","v":4},{"$f":"LaddersH!D34","v":3},{"$f":"LaddersH!E34","v":1},{"$f":"LaddersH!F34","v":0},{"$f":"LaddersH!G34","v":5},{"$f":"LaddersH!H34","v":2},{"$f":"LaddersH!I34","v":3},{"$f":"LaddersH!J34","v":10},"  Qualified WC 26"]
[null,null,{"$f":"LaddersH!B35","v":" United Arab Emirates"},{"$f":"LaddersH!C35","v":4},{"$f":"LaddersH!D35","v":1},{"$f":"LaddersH!E35","v":1},{"$f":"LaddersH!F35","v":2},{"$f":"LaddersH!G35","v":4},{"$f":"LaddersH!H35","v":4},{"$f":"LaddersH!I35","v":0},{"$f":"LaddersH!J35","v":4},"  Advances to 4th Round"]
[null,null,{"$f":"LaddersH!B36","v":"Qatar "},{"$f":"LaddersH!C36","v":4},{"$f":"LaddersH!D36","v":1},{"$f":"LaddersH!E36","v":1},{"$f":"LaddersH!F36","v":2},{"$f":"LaddersH!G36","v":7},{"$f":"LaddersH!H36","v":10},{"$f":"LaddersH!I36","v":-3},{"$f":"LaddersH!J36","v":4},"  Advances to 4th Round"]
[null,null,{"$f":"LaddersH!B37","v":" Kyrgyzstan"},{"$f":"LaddersH!C37","v":4},{"$f":"LaddersH!D37","v":1},{"$f":"LaddersH!E37","v":0},{"$f":"LaddersH!F37","v":3},{"$f":"LaddersH!G37","v":4},{"$f":"LaddersH!H37","v":7},{"$f":"LaddersH!I37","v":-3},{"$f":"LaddersH!J37","v":3},"  Eliminated"]
[null,null,{"$f":"LaddersH!B38","v":" North Korea"},{"$f":"LaddersH!C38","v":4},{"$f":"LaddersH!D38","v":0},{"$f":"LaddersH!E38","v":2},{"$f":"LaddersH!F38","v":2},{"$f":"LaddersH!G38","v":3},{"$f":"LaddersH!H38","v":5},{"$f":"LaddersH!I38","v":-2},{"$f":"LaddersH!J38","v":2},"  Eliminated"]
[]
[]
[null,null,{"$f":"LaddersH!B42","v":"Group Incomplete"},{"$f":"LaddersH!C42","v":"P"},{"$f":"LaddersH!D42","v":"W"},{"$f":"LaddersH!E42","v":"D"},{"$f":"LaddersH!F42","v":"L"},{"$f":"LaddersH!G42","v":"F"},{"$f":"LaddersH!H42","v":"A"},{"$f":"LaddersH!I42","v":"G/D"},{"$f":"LaddersH!J42","v":"Pts"}]
[null,null,{"$f":"LaddersH!B43","v":"South Korea "},{"$f":"LaddersH!C43","v":4},{"$f":"LaddersH!D43","v":3},{"$f":"LaddersH!E43","v":1},{"$f":"LaddersH!F43","v":0},{"$f":"LaddersH!G43","v":8},{"$f":"LaddersH!H43","v":3},{"$f":"LaddersH!I43","v":5},{"$f":"LaddersH!J43","v":10},"  Qualified WC 26"]
[null,null,{"$f":"LaddersH!B44","v":"Jordan "},{"$f":"LaddersH!C44","v":4},{"$f":"LaddersH!D44","v":2},{"$f":"LaddersH!E44","v":1},{"$f":"LaddersH!F44","v":1},{"$f":"LaddersH!G44","v":8},{"$f":"LaddersH!H44","v":4},{"$f":"LaddersH!I44","v":4},{"$f":"LaddersH!J44","v":7},"  Qualified WC 26"]
[null,null,{"$f":"LaddersH!B45","v":"Iraq "},{"$f":"LaddersH!C45","v":4},{"$f":"LaddersH!D45","v":2},{"$f":"LaddersH!E45","v":1},{"$f":"LaddersH!F45","v":1},{"$f":"LaddersH!G45","v":4},{"$f":"LaddersH!H45","v":3},{"$f":"LaddersH!I45","v":1},{"$f":"LaddersH!J45","v":7},"  Advances to 4th Round"]
[null,null,{"$f":"LaddersH!B46","v":" Oman"},{"$f":"LaddersH!C46","v":4},{"$f":"LaddersH!D46","v":1},{"$f":"LaddersH!E46","v":0},{"$f":"LaddersH!F46","v":3},{"$f":"LaddersH!G46","v":5},{"$f":"LaddersH!H46","v":8},{"$f":"LaddersH!I46","v":-3},{"$f":"LaddersH!J46","v":3},"  Advances to 4th Round"]
[null,null,{"$f":"LaddersH!B47","v":" Kuwait"},{"$f":"LaddersH!C47","v":4},{"$f":"LaddersH!D47","v":0},{"$f":"LaddersH!E47","v":3},{"$f":"LaddersH!F47","v":1},{"$f":"LaddersH!G47","v":3},{"$f":"LaddersH!H47","v":7},{"$f":"LaddersH!I47","v":-4},{"$f":"LaddersH!J47","v":3},"  Eliminated"]
[null,null,{"$f":"LaddersH!B48","v":" Palestine"},{"$f":"LaddersH!C48","v":4},{"$f":"LaddersH!D48","v":0},{"$f":"LaddersH!E48","v":2},{"$f":"LaddersH!F48","v":2},{"$f":"LaddersH!G48","v":3},{"$f":"LaddersH!H48","v":6},{"$f":"LaddersH!I48","v":-3},{"$f":"LaddersH!J48","v":2},"  Eliminated"]
[]
[]
[null,null,{"$f":"LaddersH!B52","v":"Group Incomplete"},{"$f":"LaddersH!C52","v":"P"},{"$f":"LaddersH!D52","v":"W"},{"$f":"LaddersH!E52","v":"D"},{"$f":"LaddersH!F52","v":"L"},{"$f":"LaddersH!G52","v":"F"},{"$f":"LaddersH!H52","v":"A"},{"$f":"LaddersH!I52","v":"G/D"},{"$f":"LaddersH!J52","v":"Pts"}]
[null,null,{"$f":"LaddersH!B53","v":"Japan "},{"$f":"LaddersH!C53","v":4},{"$f":"LaddersH!D53","v":3},{"$f":"LaddersH!E53","v":1},{"$f":"LaddersH!F53","v":0},{"$f":"LaddersH!G53","v":15},{"$f":"LaddersH!H53","v":1},{"$f":"LaddersH!I53","v":14},{"$f":"LaddersH!J53","v":10},"  Qualified WC 26"]
[null,null,{"$f":"LaddersH!B54","v":"Australia "},{"$f":"LaddersH!C54","v":4},{"$f":"LaddersH!D54","v":1},{"$f":"LaddersH!E54","v":2},{"$f":"LaddersH!F54","v":1},{"$f":"LaddersH!G54","v":4},{"$f":"LaddersH!H54","v":3},{"$f":"LaddersH!I54","v":1},{"$f":"LaddersH!J54","v":5},"  Qualified WC 26"]
[null,null,{"$f":"LaddersH!B55","v":"Saudi Arabia "},{"$f":"LaddersH!C55","v":4},{"$f":"LaddersH!D55","v":1},{"$f":"LaddersH!E55","v":2},{"$f":"LaddersH!F55","v":1},{"$f":"LaddersH!G55","v":3},{"$f":"LaddersH!H55","v":4},{"$f":"LaddersH!I55","v":-1},{"$f":"LaddersH!J55","v":5},"  Advances to 4th Round"]
[null,null,{"$f":"LaddersH!B56","v":" Bahrain"},{"$f":"LaddersH!C56","v":4},{"$f":"LaddersH!D56","v":1},{"$f":"LaddersH!E56","v":2},{"$f":"LaddersH!F56","v":1},{"$f":"LaddersH!G56","v":3},{"$f":"LaddersH!H56","v":7},{"$f":"LaddersH!I56","v":-4},{"$f":"LaddersH!J56","v":5},"  Advances to 4th Round"]
[null,null,{"$f":"LaddersH!B57","v":" Indonesia"},{"$f":"LaddersH!C57","v":4},{"$f":"LaddersH!D57","v":0},{"$f":"LaddersH!E57","v":3},{"$f":"LaddersH!F57","v":1},{"$f":"LaddersH!G57","v":4},{"$f":"LaddersH!H57","v":5},{"$f":"LaddersH!I57","v":-1},{"$f":"LaddersH!J57","v":3},"  Eliminated"]
[null,null,{"$f":"LaddersH!B58","v":" China"},{"$f":"LaddersH!C58","v":4},{"$f":"LaddersH!D58","v":1},{"$f":"LaddersH!E58","v":0},{"$f":"LaddersH!F58","v":3},{"$f":"LaddersH!G58","v":4},{"$f":"LaddersH!H58","v":13},{"$f":"LaddersH!I58","v":-9},{"$f":"LaddersH!J58","v":3},"  Eliminated"]