{"text_format":"1","workbook":"xlsx","n_sheets":6,"sheets":["Fixtures","Grid","Ladder","LadderH","Finals","FinalsH"],"not_rendered":{"charts":0,"images":0,"macros":1,"external_links":0,"defined_names":7,"comments":0,"pivot_tables":0},"unopened":[],"bounds":{"document_bytes":16777216,"sheet_cells":100000,"rows_first":2000,"rows_last":500,"rows_between":2000,"halvings":0,"cell_chars":16384,"cell_head_chars":4096},"cells_cut":0,"cells_raw":0,"read":"whole","date_system":"1900"}

{"sheet":"Fixtures","index":0,"n_rows":233,"n_cols":21,"rows_kept":233,"cut":false,"hidden":false,"merged":[]}
[null,null,null,null,null,null,null,null,null,"v2: 181024 - (Ladder sort)"]
[null,"Round","Round","Date","SE Oz","Local","Venue","HomeClub",null,"AwayClub",null,null,null,null,null,null,null,null,null,"MAC","CCM"]
[null,null,1,"2024-10-18","19:35:00","19:35:00","Industree Group Stadium","Central Coast Mariners","v","Melbourne Victory",0,0,null,null,"CCM","VIC",null,1,13,{"$f":"IF(AND(K3=$T$2,L3=$U$2),\"YES!!\",\"no!\")","v":"no!"}]
[null,null,1,"2024-10-19","15:00:00","17:00:00","GO Media Stadium","Auckland FC","v","Brisbane Roar FC",2,0,null,null,"UCK","BRI",null,2,3,{"$f":"IF(AND(K4=$T$2,L4=$U$2),\"YES!!\",\"no!\")","v":"no!"}]
[null,null,1,"2024-10-19","17:00:00","17:00:00","McDonald Jones Stadium","Newcastle Jets","v","Melbourne City FC",0,1,null,null,"NEW","MCT",null,4,5,"no!"]
[null,null,1,"2024-10-19","19:35:00","19:35:00","CommBank Stadium","Western Sydney Wanderers FC","v","Sydney FC",1,2,null,null,"WSW","SYD",null,6,7,"no!"]
[null,null,1,"2024-10-20","14:00:00","16:00:00","Sky Stadium","Wellington Phoenix","v","Western United FC",1,1,null,null,"PHX","WUT",null,8,9,"no!"]
[null,null,1,"2024-10-20","16:00:00","16:00:00","Campbelltown Stadium","Macarthur FC","v","Perth Glory",6,1,null,null,"MAC","GLO",null,10,11,"no!"]
[null,null,null,null,null,null,null,"Adelaide United",null,"BYE",null,null,null,null,null,null,null,null,null,"no!"]
[null,null,2,"2024-10-25","19:35:00","19:35:00","Campbelltown Stadium","Macarthur FC","v","Newcastle Jets",null,null,null,null,"MAC","NEW",null,10,4,"no!"]
[null,null,2,"2024-10-26","17:00:00","16:30:00","Coopers Stadium","Adelaide United","v","Central Coast Mariners",null,null,null,null,"ADU","CCM",null,12,1,"no!"]
[null,null,2,"2024-10-26","19:35:00","19:35:00","AAMI Park","Melbourne City FC","v","Melbourne Victory",null,null,null,null,"MCT","VIC",null,5,13,"no!"]
[null,null,2,"2024-10-26","21:45:00","18:45:00","HBF Park","Perth Glory","v","Wellington Phoenix",null,null,null,null,"GLO","PHX",null,11,8,"no!"]
[null,null,2,"2024-10-27","14:00:00","16:00:00","GO Media Stadium","Auckland FC","v","Sydney FC",null,null,null,null,"UCK","SYD",null,2,7,"no!"]
[null,null,2,"2024-10-27","16:00:00","16:00:00","Ironbark Fields","Western United FC","v","Western Sydney Wanderers FC",null,null,null,null,"WUT","WSW",null,9,6,"no!"]
[null,null,null,null,null,null,null,"Brisbane Roar FC",null,"BYE",null,null,null,null,null,null,null,null,null,"no!"]
[null,"Sports System © McRopod Concepts 2024"]
[null,null,3,"2024-11-01","19:35:00","18:35:00","Suncorp Stadium","Brisbane Roar FC","v","Sydney FC",null,null,null,null,"BRI","SYD",null,3,7,"no!"]
[null,null,3,"2024-11-02","15:00:00","17:00:00","Sky Stadium","Wellington Phoenix","v","Auckland FC",null,null,null,null,"PHX","UCK",null,8,2,"no!"]
[null,null,3,"2024-11-02","17:00:00","17:00:00","Industree Group Stadium","Central Coast Mariners","v","Perth Glory",null,null,null,null,"CCM","GLO",null,1,11,"no!"]
[null,null,3,"2024-11-02","19:35:00","19:35:00","CommBank Stadium","Western Sydney Wanderers FC","v","Adelaide United",null,null,null,null,"WSW","ADU",null,6,12,"no!"]
[null,null,3,"2024-11-03","16:00:00","16:00:00","AAMI Park","Melbourne Victory","v","Macarthur FC",null,null,null,null,"VIC","MAC",null,13,10,"no!"]
[null,null,3,"2024-11-04","19:00:00","19:00:00","TBC","Western United FC","v","Melbourne City FC",null,null,null,null,"WUT","MCT",null,9,5,"no!"]
[null,null,null,null,null,null,null,"Newcastle Jets",null,"BYE",null,null,null,null,null,null,null,null,null,"no!"]
[null,null,4,"2024-11-08","19:35:00","19:35:00","CommBank Stadium","Western Sydney Wanderers FC","v","Newcastle Jets",null,null,null,null,"WSW","NEW",null,6,4,"no!"]
[null,null,4,"2024-11-09","17:00:00","17:00:00","AAMI Park","Melbourne Victory","v","Brisbane Roar FC",null,null,null,null,"VIC","BRI",null,13,3,"no!"]
[null,null,4,"2024-11-09","19:35:00","19:35:00","Allianz Stadium","Sydney FC","v","Macarthur FC",null,null,null,null,"SYD","MAC",null,7,10,"no!"]
[null,null,4,"2024-11-09","20:30:00","20:00:00","Coopers Stadium","Adelaide United","v","Western United FC",null,null,null,null,"ADU","WUT",null,12,9,"no!"]
[null,null,4,"2024-11-10","16:00:00","16:00:00","Industree Group Stadium","Central Coast Mariners","v","Wellington Phoenix",null,null,null,null,"CCM","PHX",null,1,8,"no!"]
[null,null,4,"2024-11-10","20:45:00","17:45:00","HBF Park","Perth Glory","v","Melbourne City FC",null,null,null,null,"GLO","MCT",null,11,5,"no!"]
[null,null,null,null,null,null,null,"Auckland FC",null,"BYE",null,null,null,null,null,null,null,null,null,"no!"]
[null,null,5,"2024-11-22","17:30:00","17:30:00","Allianz Stadium","Perth Glory","v","Western United FC",null,null,null,null,"GLO","WUT",null,11,9,"no!"]
[null,null,5,"2024-11-22","20:00:00","20:00:00","Allianz Stadium","Newcastle Jets","v","Central Coast Mariners",null,null,null,null,"NEW","CCM",null,4,1,"no!"]
[null,null,5,"2024-11-23","17:00:00","17:00:00","Allianz Stadium","Brisbane Roar FC","v","Adelaide United",null,null,null,null,"BRI","ADU",null,3,12,"no!"]
[null,null,5,"2024-11-23","19:35:00","19:35:00","Allianz Stadium","Sydney FC","v","Western Sydney Wanderers FC",null,null,null,null,"SYD","WSW",null,7,6,"no!"]
[null,null,5,"2024-11-24","13:30:00","13:30:00","Allianz Stadium","Wellington Phoenix","v","Melbourne Victory",null,null,null,null,"PHX","VIC",null,8,13,"no!"]
[null,null,5,"2024-11-24","16:00:00","16:00:00","Allianz Stadium","Macarthur FC","v","Auckland FC",null,null,null,null,"MAC","UCK",null,10,2,"no!"]
[null,null,null,null,null,null,null,"Melbourne City FC",null,"BYE",null,null,null,null,null,null,null,null,null,"no!"]
[null,null,6,"2024-11-29","19:35:00","19:05:00","Coopers Stadium","Adelaide United","v","Perth Glory",null,null,null,null,"ADU","GLO",null,12,11,"no!"]
[null,null,6,"2024-11-30","15:00:00","17:00:00","GO Media Stadium","Auckland FC","v","Newcastle Jets",null,null,null,null,"UCK","NEW",null,2,4,"no!"]
[null,null,6,"2024-11-30","17:00:00","17:00:00","AAMI Park","Melbourne City FC","v","Western Sydney Wanderers FC",null,null,null,null,"MCT","WSW",null,5,6,"no!"]
[null,null,6,"2024-11-30","19:35:00","19:35:00","TBC","Western United FC","v","Melbourne Victory",null,null,null,null,"WUT","VIC",null,9,13,"no!"]
[null,null,6,"2024-12-01","17:00:00","17:00:00","Campbelltown Stadium","Macarthur FC","v","Brisbane Roar FC",null,null,null,null,"MAC","BRI",null,10,3,"no!"]
[null,null,6,null,null,null,null,"Central Coast Mariners",null,"BYE",null,null,null,null,null,null,null,null,null,"no!"]
[null,null,null,null,null,null,null,"Sydney FC",null,"BYE",null,null,null,null,null,null,null,null,null,"no!"]
[null,null,null,null,null,null,null,"Wellington Phoenix",null,"BYE",null,null,null,null,null,null,null,null,null,"no!"]
[null,null,7,"2024-12-06","19:35:00","18:35:00","Suncorp Stadium","Brisbane Roar FC","v","Melbourne City FC",null,null,null,null,"BRI","MCT",null,3,5,"no!"]
[null,null,7,"2024-12-07","15:00:00","17:00:00","GO Media Stadium","Auckland FC","v","Wellington Phoenix",null,null,null,null,"UCK","PHX",null,2,8,"no!"]
[null,null,7,"2024-12-07","17:00:00","17:00:00","McDonald Jones Stadium","Newcastle Jets","v","Adelaide United",null,null,null,null,"NEW","ADU",null,4,12,"no!"]
[null,null,7,"2024-12-07","18:00:00","18:00:00","Ironbark Fields","Western United FC","v","Macarthur FC",null,null,null,null,"WUT","MAC",null,9,10,"no!"]
[null,null,7,"2024-12-07","19:35:00","19:35:00","Industree Group Stadium","Central Coast Mariners","v","Sydney FC",null,null,null,null,"CCM","SYD",null,1,7,"no!"]
[null,null,7,"2024-12-08","17:00:00","17:00:00","AAMI Park","Melbourne Victory","v","Perth Glory",null,null,null,null,"VIC","GLO",null,13,11,"no!"]
[null,null,null,null,null,null,null,"Western Sydney Wanderers FC",null,"BYE",null,null,null,null,null,null,null,null,null,"no!"]
[null,null,8,"2024-12-13","19:35:00","19:35:00","Industree Group Stadium","Central Coast Mariners","v","Adelaide United",null,null,null,null,"CCM","ADU",null,1,12,"no!"]
[null,null,8,"2024-12-14","15:00:00","17:00:00","Sky Stadium","Wellington Phoenix","v","Macarthur FC",null,null,null,null,"PHX","MAC",null,8,10,"no!"]
[null,null,8,"2024-12-14","17:00:00","17:00:00","Allianz Stadium","Sydney FC","v","Western United FC",null,null,null,null,"SYD","WUT",null,7,9,"no!"]
[null,null,8,"2024-12-14","19:35:00","19:35:00","CommBank Stadium","Western Sydney Wanderers FC","v","Brisbane Roar FC",null,null,null,null,"WSW","BRI",null,6,3,"no!"]
[null,null,8,"2024-12-14","21:45:00","18:45:00","HBF Park","Perth Glory","v","Newcastle Jets",null,null,null,null,"GLO","NEW",null,11,4,"no!"]
[null,null,8,"2024-12-15","17:00:00","17:00:00","AAMI Park","Melbourne City FC","v","Auckland FC",null,null,null,null,"MCT","UCK",null,5,2,"no!"]
[null,null,null,null,null,null,null,"Melbourne Victory",null,"BYE",null,null,null,null,null,null,null,null,null,"no!"]
[null,null,9,"2024-12-20","19:35:00","19:05:00","Coopers Stadium","Adelaide United","v","Sydney FC",null,null,null,null,"ADU","SYD",null,12,7,"no!"]
[null,null,9,"2024-12-21","15:00:00","17:00:00","GO Media Stadium","Auckland FC","v","Western United FC",null,null,null,null,"UCK","WUT",null,2,9,"no!"]
[null,null,9,"2024-12-21","17:00:00","16:00:00","Suncorp Stadium","Brisbane Roar FC","v","Perth Glory",null,null,null,null,"BRI","GLO",null,3,11,"no!"]
[null,null,9,"2024-12-21","19:35:00","19:35:00","AAMI Park","Melbourne Victory","v","Melbourne City FC",null,null,null,null,"VIC","MCT",null,13,5,"no!"]
[null,null,9,"2024-12-22","17:00:00","17:00:00","CommBank Stadium","Western Sydney Wanderers FC","v","Wellington Phoenix",null,null,null,null,"WSW","PHX",null,6,8,"no!"]
[null,null,9,"2024-12-23","19:00:00","19:00:00","Campbelltown Stadium","Macarthur FC","v","Central Coast Mariners",null,null,null,null,"MAC","CCM",null,10,1,"no!"]
[null,null,null,null,null,null,null,"Newcastle Jets",null,"BYE",null,null,null,null,null,null,null,null,null,"no!"]
[null,null,10,"2024-12-27","19:35:00","19:05:00","Coopers Stadium","Adelaide United","v","Western Sydney Wanderers FC",null,null,null,null,"ADU","WSW",null,12,6,"no!"]
[null,null,10,"2024-12-27","21:45:00","18:45:00","HBF Park","Perth Glory","v","Macarthur FC",null,null,null,null,"GLO","MAC",null,11,10,"no!"]
[null,null,10,"2024-12-28","15:00:00","17:00:00","Sky Stadium","Wellington Phoenix","v","Newcastle Jets",null,null,null,null,"PHX","NEW",null,8,4,"no!"]
[null,null,10,"2024-12-28","17:00:00","17:00:00","Industree Group Stadium","Central Coast Mariners","v","Auckland FC",null,null,null,null,"CCM","UCK",null,1,2,"no!"]
[null,null,10,"2024-12-28","19:35:00","19:35:00","Allianz Stadium","Sydney FC","v","Melbourne Victory",null,null,null,null,"SYD","VIC",null,7,13,"no!"]
[null,null,10,"2024-12-29","17:00:00","17:00:00","Ironbark Fields","Western United FC","v","Brisbane Roar FC",null,null,null,null,"WUT","BRI",null,9,3,"no!"]
[null,null,null,null,null,null,null,"Melbourne City FC",null,"BYE",null,null,null,null,null,null,null,null,null,"no!"]
[null,"Sports System © McRopod Concepts 2024"]
[null,null,11,"2024-12-31","19:00:00","19:00:00","Industree Group Stadium","Central Coast Mariners","v","Melbourne City FC",null,null,null,null,"CCM","MCT",null,1,5,"no!"]
[null,null,11,"2025-01-01","15:00:00","17:00:00","GO Media Stadium","Auckland FC","v","Melbourne Victory",null,null,null,null,"UCK","VIC",null,2,13,"no!"]
[null,null,11,"2025-01-01","18:00:00","18:00:00","CommBank Stadium","Western Sydney Wanderers FC","v","Macarthur FC",null,null,null,null,"WSW","MAC",null,6,10,"no!"]
[null,null,11,null,null,null,null,"Adelaide United",null,"BYE",null,null,null,null,null,null,null,null,null,"no!"]
[null,null,11,null,null,null,null,"Wellington Phoenix",null,"BYE",null,null,null,null,null,null,null,null,null,"no!"]
[null,null,11,null,null,null,null,"Western United FC",null,"BYE",null,null,null,null,null,null,null,null,null,{"$f":"IF(AND(K81=$T$2,L81=$U$2),\"YES!!\",\"no!\")","v":"no!"}]
[null,null,null,"2025-01-07","20:00:00","19:00:00","Suncorp Stadium","Brisbane Roar FC","v","Newcastle Jets",null,null,null,null,"BRI","NEW",null,3,4,"no!"]
[null,null,null,"2025-01-08","19:00:00","19:00:00","Allianz Stadium","Sydney FC","v","Perth Glory",null,null,null,null,"SYD","GLO",null,7,11,"no!"]
[null,null,12,"2025-01-03","17:00:00","17:00:00","AAMI Park","Melbourne City FC","v","Wellington Phoenix",null,null,null,null,"MCT","PHX",null,5,8,"no!"]
[null,null,12,"2025-01-03","19:35:00","18:35:00","Suncorp Stadium","Brisbane Roar FC","v","Central Coast Mariners",null,null,null,null,"BRI","CCM",null,3,1,"no!"]
[null,null,12,"2025-01-03","21:45:00","18:45:00","HBF Park","Perth Glory","v","Western United FC",null,null,null,null,"GLO","WUT",null,11,9,"no!"]
[null,null,12,"2025-01-04","17:00:00","17:00:00","McDonald Jones Stadium","Newcastle Jets","v","Sydney FC",null,null,null,null,"NEW","SYD",null,4,7,"no!"]
[null,null,12,"2025-01-04","19:35:00","19:35:00","AAMI Park","Melbourne Victory","v","Western Sydney Wanderers FC",null,null,null,null,"VIC","WSW",null,13,6,"no!"]
[null,null,12,"2025-01-06","19:00:00","19:00:00","Campbelltown Stadium","Macarthur FC","v","Adelaide United",null,null,null,null,"MAC","ADU",null,10,12,"no!"]
[null,null,null,null,null,null,null,"Auckland FC",null,"BYE",null,null,null,null,null,null,null,null,null,"no!"]
[null,null,13,"2025-01-10","19:35:00","19:35:00","AAMI Park","Melbourne Victory","v","Western United FC",null,null,null,null,"VIC","WUT",null,13,9,"no!"]
[null,null,13,"2025-01-11","15:00:00","17:00:00","Sky Stadium","Wellington Phoenix","v","Adelaide United",null,null,null,null,"PHX","ADU",null,8,12,"no!"]
[null,null,13,"2025-01-11","17:00:00","17:00:00","AAMI Park","Melbourne City FC","v","Brisbane Roar FC",null,null,null,null,"MCT","BRI",null,5,3,"no!"]
[null,null,13,"2025-01-11","19:35:00","19:35:00","Allianz Stadium","Sydney FC","v","Central Coast Mariners",null,null,null,null,"SYD","CCM",null,7,1,"no!"]
[null,null,13,"2025-01-11","21:45:00","18:45:00","HBF Park","Perth Glory","v","Auckland FC",null,null,null,null,"GLO","UCK",null,11,2,"no!"]
[null,null,13,"2025-01-12","17:00:00","17:00:00","McDonald Jones Stadium","Newcastle Jets","v","Macarthur FC",null,null,null,null,"NEW","MAC",null,4,10,"no!"]
[null,null,null,null,null,null,null,"Western Sydney Wanderers FC",null,"BYE",null,null,null,null,null,null,null,null,null,"no!"]
[null,null,14,"2025-01-14","21:45:00","18:45:00","HBF Park","Perth Glory","v","Western Sydney Wanderers FC",null,null,null,null,"GLO","WSW",null,11,6,"no!"]
[null,null,14,"2025-01-15","17:00:00","19:00:00","Sky Stadium","Wellington Phoenix","v","Sydney FC",null,null,null,null,"PHX","SYD",null,8,7,"no!"]
[null,null,14,null,null,null,null,"Brisbane Roar FC",null,"BYE",null,null,null,null,null,null,null,null,null,"no!"]
[null,null,14,null,null,null,null,"Macarthur FC",null,"BYE",null,null,null,null,null,null,null,null,null,"no!"]
[null,null,14,null,null,null,null,"Melbourne Victory",null,"BYE",null,null,null,null,null,null,null,null,null,"no!"]
[null,null,14,"2025-01-22","19:30:00","19:00:00","Coopers Stadium","Adelaide United","v","Auckland FC",null,null,null,null,"ADU","UCK",null,12,2,"no!"]
[null,null,null,"2025-01-29","19:00:00","19:00:00","Ironbark Fields","Western United FC","v","Central Coast Mariners",null,null,null,null,"WUT","CCM",null,9,1,"no!"]
[null,null,null,"2025-03-12","19:00:00","19:00:00","AAMI Park","Melbourne City FC","v","Newcastle Jets",null,null,null,null,"MCT","NEW",null,5,4,"no!"]
[null,null,15,"2025-01-17","19:35:00","19:35:00","CommBank Stadium","Western Sydney Wanderers FC","v","Central Coast Mariners",null,null,null,null,"WSW","CCM",null,6,1,"no!"]
[null,null,15,"2025-01-18","15:00:00","17:00:00","GO Media Stadium","Auckland FC","v","Melbourne City FC",null,null,null,null,"UCK","MCT",null,2,5,"no!"]
[null,null,15,"2025-01-18","17:00:00","17:00:00","Allianz Stadium","Sydney FC","v","Brisbane Roar FC",null,null,null,null,"SYD","BRI",null,7,3,"no!"]
[null,null,15,"2025-01-18","18:00:00","18:00:00","Ironbark Fields","Western United FC","v","Newcastle Jets",null,null,null,null,"WUT","NEW",null,9,4,"no!"]
[null,null,15,"2025-01-18","19:35:00","19:05:00","Coopers Stadium","Adelaide United","v","Melbourne Victory",null,null,null,null,"ADU","VIC",null,12,13,"no!"]
[null,null,15,"2025-01-20","19:00:00","19:00:00","Campbelltown Stadium","Macarthur FC","v","Wellington Phoenix",null,null,null,null,"MAC","PHX",null,10,8,"no!"]
[null,null,null,null,null,null,null,"Perth Glory",null,"BYE",null,null,null,null,null,null,null,null,null,"no!"]
[null,null,16,"2025-01-24","19:35:00","19:35:00","AAMI Park","Melbourne Victory","v","Sydney FC",null,null,null,null,"VIC","SYD",null,13,7,"no!"]
[null,null,16,"2025-01-25","15:00:00","17:00:00","TBC","Wellington Phoenix","v","Central Coast Mariners",null,null,null,null,"PHX","CCM",null,8,1,"no!"]
[null,null,16,"2025-01-25","17:00:00","16:00:00","Suncorp Stadium","Brisbane Roar FC","v","Adelaide United",null,null,null,null,"BRI","ADU",null,3,12,"no!"]
[null,null,16,"2025-01-25","18:00:00","18:00:00","McDonald Jones Stadium","Newcastle Jets","v","Perth Glory",null,null,null,null,"NEW","GLO",null,4,11,"no!"]
[null,null,16,"2025-01-25","19:35:00","19:35:00","Campbelltown Stadium","Macarthur FC","v","Melbourne City FC",null,null,null,null,"MAC","MCT",null,10,5,"no!"]
[null,null,16,"2025-01-26","17:00:00","17:00:00","CommBank Stadium","Western Sydney Wanderers FC","v","Auckland FC",null,null,null,null,"WSW","UCK",null,6,2,"no!"]
[null,null,null,null,null,null,null,"Western United FC",null,"BYE",null,null,null,null,null,null,null,null,null,"no!"]
[null,null,17,"2025-01-07","18:00:00","18:00:00","AAMI Park","Melbourne City FC","v","Western United FC",null,null,null,null,"MCT","WUT",null,5,9,"no!"]
[null,null,17,"2025-01-31","19:35:00","18:35:00","Suncorp Stadium","Brisbane Roar FC","v","Western Sydney Wanderers FC",null,null,null,null,"BRI","WSW",null,3,6,"no!"]
[null,null,17,"2025-02-01","15:00:00","17:00:00","GO Media Stadium","Auckland FC","v","Macarthur FC",null,null,null,null,"UCK","MAC",null,2,10,"no!"]
[null,null,17,"2025-02-01","17:00:00","17:00:00","Allianz Stadium","Sydney FC","v","Adelaide United",null,null,null,null,"SYD","ADU",null,7,12,"no!"]
[null,null,17,"2025-02-01","19:35:00","19:35:00","Industree Group Stadium","Central Coast Mariners","v","Newcastle Jets",null,null,null,null,"CCM","NEW",null,1,4,"no!"]
[null,null,17,"2025-02-01","21:45:00","18:45:00","HBF Park","Perth Glory","v","Melbourne Victory",null,null,null,null,"GLO","VIC",null,11,13,"no!"]
[null,null,null,null,null,null,null,"Wellington Phoenix",null,"BYE",null,null,null,null,null,null,null,null,null,"no!"]
[null,null,18,"2025-02-06","15:00:00","17:00:00","Sky Stadium","Wellington Phoenix","v","Brisbane Roar FC",null,null,null,null,"PHX","BRI",null,8,3,"no!"]
[null,null,18,"2025-02-07","19:35:00","19:05:00","Coopers Stadium","Adelaide United","v","Melbourne City FC",null,null,null,null,"ADU","MCT",null,12,5,"no!"]
[null,null,18,"2025-02-07","21:45:00","18:45:00","HBF Park","Perth Glory","v","Central Coast Mariners",null,null,null,null,"GLO","CCM",null,11,1,"no!"]
[null,null,18,"2025-02-08","17:00:00","17:00:00","McDonald Jones Stadium","Newcastle Jets","v","Melbourne Victory",null,null,null,null,"NEW","VIC",null,4,13,"no!"]
[null,null,18,"2025-02-08","19:35:00","19:35:00","Allianz Stadium","Sydney FC","v","Western Sydney Wanderers FC",null,null,null,null,"SYD","WSW",null,7,6,"no!"]
[null,null,18,"2025-02-09","17:00:00","17:00:00","Campbelltown Stadium","Macarthur FC","v","Western United FC",null,null,null,null,"MAC","WUT",null,10,9,"no!"]
[null,null,null,null,null,null,null,"Auckland FC",null,"BYE",null,null,null,null,null,null,null,null,null,"no!"]
[null,"Sports System © McRopod Concepts 2024"]
[null,null,19,"2025-02-14","19:35:00","19:35:00","AAMI Park","Melbourne Victory","v","Wellington Phoenix",null,null,null,null,"VIC","PHX",null,13,8,"no!"]
[null,null,19,"2025-02-15","17:00:00","16:30:00","AAMI Park","Melbourne City FC","v","Perth Glory",null,null,null,null,"MCT","GLO",null,5,11,"no!"]
[null,null,19,"2025-02-15","18:00:00","18:00:00","Ironbark Fields","Western United FC","v","Auckland FC",null,null,null,null,"WUT","UCK",null,9,2,"no!"]
[null,null,19,"2025-02-15","19:35:00","19:05:00","Coopers Stadium","Adelaide United","v","Newcastle Jets",null,null,null,null,"ADU","NEW",null,12,4,"no!"]
[null,null,19,"2025-02-16","17:00:00","17:00:00","CommBank Stadium","Western Sydney Wanderers FC","v","Macarthur FC",null,null,null,null,"WSW","MAC",null,6,10,"no!"]
[null,null,19,null,null,null,null,"Brisbane Roar FC",null,"BYE",null,null,null,null,null,null,null,null,null,"no!"]
[null,null,null,null,null,null,null,"Central Coast Mariners",null,"BYE",null,null,null,null,null,null,null,null,null,"no!"]
[null,null,null,null,null,null,null,"Sydney FC",null,"BYE",null,null,null,null,null,null,null,null,null,"no!"]
[null,null,20,"2025-02-21","19:35:00","19:35:00","McDonald Jones Stadium","Newcastle Jets","v","Brisbane Roar FC",null,null,null,null,"NEW","BRI",null,4,3,"no!"]
[null,null,20,"2025-02-22","15:00:00","17:00:00","Go Media Stadium","Auckland FC","v","Wellington Phoenix",null,null,null,null,"UCK","PHX",null,2,8,"no!"]
[null,null,20,"2025-02-22","17:00:00","17:00:00","Industree Group Stadium","Central Coast Mariners","v","Western Sydney Wanderers FC",null,null,null,null,"CCM","WSW",null,1,6,"no!"]
[null,null,20,"2025-02-22","19:35:00","19:35:00","AAMI Park","Melbourne Victory","v","Melbourne City FC",null,null,null,null,"VIC","MCT",null,13,5,{"$f":"IF(AND(K146=$T$2,L146=$U$2),\"YES!!\",\"no!\")","v":"no!"}]
[null,null,20,"2025-02-22","21:45:00","18:45:00","HBF Park","Perth Glory","v","Sydney FC",null,null,null,null,"GLO","SYD",null,11,7,"no!"]
[null,null,20,"2025-02-23","17:00:00","17:00:00","Ironbark Fields","Western United FC","v","Adelaide United",null,null,null,null,"WUT","ADU",null,9,12,"no!"]
[null,null,null,null,null,null,null,"Macarthur FC",null,"BYE",null,null,null,null,null,null,null,null,null,"no!"]
[null,null,21,"2025-02-28","17:30:00","19:30:00","Sky Stadium","Wellington Phoenix","v","Melbourne City FC",null,null,null,null,"PHX","MCT",null,8,5,"no!"]
[null,null,21,"2025-02-28","19:35:00","19:35:00","Industree Group Stadium","Central Coast Mariners","v","Western United FC",null,null,null,null,"CCM","WUT",null,1,9,"no!"]
[null,null,21,"2025-03-01","15:00:00","17:00:00","GO Media Stadium","Auckland FC","v","Adelaide United",null,null,null,null,"UCK","ADU",null,2,12,"no!"]
[null,null,21,"2025-03-01","17:00:00","16:00:00","Suncorp Stadium","Brisbane Roar FC","v","Melbourne Victory",null,null,null,null,"BRI","VIC",null,3,13,"no!"]
[null,null,21,"2025-03-01","19:35:00","19:35:00","Campbelltown Stadium","Macarthur FC","v","Sydney FC",null,null,null,null,"MAC","SYD",null,10,7,"no!"]
[null,null,21,"2025-03-02","17:00:00","17:00:00","CommBank Stadium","Western Sydney Wanderers FC","v","Perth Glory",null,null,null,null,"WSW","GLO",null,6,11,"no!"]
[null,null,null,null,null,null,null,"Newcastle Jets",null,"BYE",null,null,null,null,null,null,null,null,null,"no!"]
[null,null,22,"2025-03-07","19:35:00","19:35:00","AAMI Park","Melbourne City FC","v","Macarthur FC",null,null,null,null,"MCT","MAC",null,5,10,"no!"]
[null,null,22,"2025-03-08","17:00:00","16:30:00","Coopers Stadium","Adelaide United","v","Brisbane Roar FC",null,null,null,null,"ADU","BRI",null,12,3,"no!"]
[null,null,22,"2025-03-08","18:00:00","18:00:00","Ironbark Fields","Western United FC","v","Wellington Phoenix",null,null,null,null,"WUT","PHX",null,9,8,"no!"]
[null,null,22,"2025-03-08","19:35:00","19:35:00","AAMI Park","Melbourne Victory","v","Central Coast Mariners",null,null,null,null,"VIC","CCM",null,13,1,"no!"]
[null,null,22,"2025-03-09","17:00:00","17:00:00","McDonald Jones Stadium","Newcastle Jets","v","Auckland FC",null,null,null,null,"NEW","UCK",null,4,2,"no!"]
[null,null,22,null,null,null,null,"Perth Glory",null,"BYE",null,null,null,null,null,null,null,null,null,"no!"]
[null,null,null,null,null,null,null,"Sydney FC",null,"BYE",null,null,null,null,null,null,null,null,null,"no!"]
[null,null,null,null,null,null,null,"Western Sydney Wanderers FC",null,"BYE",null,null,null,null,null,null,null,null,null,"no!"]
[null,null,23,"2025-03-14","19:35:00","19:05:00","Coopers Stadium","Adelaide United","v","Macarthur FC",null,null,null,null,"ADU","MAC",null,12,10,"no!"]
[null,null,23,"2025-03-15","17:00:00","17:00:00","Allianz Stadium","Sydney FC","v","Wellington Phoenix",null,null,null,null,"SYD","PHX",null,7,8,"no!"]
[null,null,23,"2025-03-15","19:35:00","19:35:00","CommBank Stadium","Western Sydney Wanderers FC","v","Melbourne Victory",null,null,null,null,"WSW","VIC",null,6,13,"no!"]
[null,null,23,"2025-03-15","21:45:00","18:45:00","HBF Park","Perth Glory","v","Brisbane Roar FC",null,null,null,null,"GLO","BRI",null,11,3,"no!"]
[null,null,23,"2025-03-16","15:00:00","17:00:00","GO Media Stadium","Auckland FC","v","Central Coast Mariners",null,null,null,null,"UCK","CCM",null,2,1,"no!"]
[null,null,23,"2025-03-16","17:00:00","17:00:00","McDonald Jones Stadium","Newcastle Jets","v","Western United FC",null,null,null,null,"NEW","WUT",null,4,9,"no!"]
[null,null,null,null,null,null,null,"Melbourne City FC",null,"BYE",null,null,null,null,null,null,null,null,null,"no!"]
[null,null,24,"2025-03-28","19:35:00","19:35:00","Campbelltown Stadium","Macarthur FC","v","Newcastle Jets",null,null,null,null,"MAC","NEW",null,10,4,"no!"]
[null,null,24,"2025-03-29","15:00:00","17:00:00","Sky Stadium","Wellington Phoenix","v","Western Sydney Wanderers FC",null,null,null,null,"PHX","WSW",null,8,6,"no!"]
[null,null,24,"2025-03-29","17:00:00","17:00:00","Allianz Stadium","Sydney FC","v","Melbourne City FC",null,null,null,null,"SYD","MCT",null,7,5,"no!"]
[null,null,24,"2025-03-29","19:35:00","19:35:00","AAMI Park","Melbourne Victory","v","Adelaide United",null,null,null,null,"VIC","ADU",null,13,12,"no!"]
[null,null,24,"2025-03-30","15:00:00","15:00:00","Industree Group Stadium","Central Coast Mariners","v","Perth Glory",null,null,null,null,"CCM","GLO",null,1,11,"no!"]
[null,null,24,"2025-03-30","17:00:00","16:00:00","Suncorp Stadium","Brisbane Roar FC","v","Auckland FC",null,null,null,null,"BRI","UCK",null,3,2,"no!"]
[null,null,null,null,null,null,null,"Western United FC",null,"BYE",null,null,null,null,null,null,null,null,null,"no!"]
[null,null,25,"2025-04-04","19:35:00","18:35:00","Suncorp Stadium","Brisbane Roar FC","v","Macarthur FC",null,null,null,null,"BRI","MAC",null,3,10,"no!"]
[null,null,25,"2025-04-05","15:00:00","17:00:00","GO Media Stadium","Auckland FC","v","Western Sydney Wanderers FC",null,null,null,null,"UCK","WSW",null,2,6,"no!"]
[null,null,25,"2025-04-05","17:00:00","17:00:00","AAMI Park","Melbourne City FC","v","Central Coast Mariners",null,null,null,null,"MCT","CCM",null,5,1,"no!"]
[null,null,25,"2025-04-05","18:00:00","18:00:00","Ironbark Fields","Western United FC","v","Perth Glory",null,null,null,null,"WUT","GLO",null,9,11,"no!"]
[null,null,25,"2025-04-05","19:35:00","19:05:00","Coopers Stadium","Adelaide United","v","Sydney FC",null,null,null,null,"ADU","SYD",null,12,7,"no!"]
[null,null,25,"2025-04-06","17:00:00","17:00:00","McDonald Jones Stadium","Newcastle Jets","v","Wellington Phoenix",null,null,null,null,"NEW","PHX",null,4,8,"no!"]
[null,null,null,null,null,null,null,"Melbourne Victory",null,"BYE",null,null,null,null,null,null,null,null,null,"no!"]
[null,null,26,"2025-04-11","19:35:00","19:35:00","AAMI Park","Melbourne City FC","v","Brisbane Roar FC",null,null,null,null,"MCT","BRI",null,5,3,"no!"]
[null,null,26,"2025-04-12","15:00:00","17:00:00","Sky Stadium","Wellington Phoenix","v","Melbourne Victory",null,null,null,null,"PHX","VIC",null,8,13,"no!"]
[null,null,26,"2025-04-12","17:00:00","17:00:00","Allianz Stadium","Sydney FC","v","Auckland FC",null,null,null,null,"SYD","UCK",null,7,2,"no!"]
[null,null,26,"2025-04-12","19:35:00","19:35:00","McDonald Jones Stadium","Newcastle Jets","v","Central Coast Mariners",null,null,null,null,"NEW","CCM",null,4,1,"no!"]
[null,null,26,"2025-04-12","21:45:00","19:45:00","HBF Park","Perth Glory","v","Adelaide United",null,null,null,null,"GLO","ADU",null,11,12,"no!"]
[null,null,26,"2025-04-13","17:00:00","17:00:00","CommBank Stadium","Western Sydney Wanderers FC","v","Western United FC",null,null,null,null,"WSW","WUT",null,6,9,"no!"]
[null,null,null,null,null,null,null,"Macarthur FC",null,"BYE",null,null,null,null,null,null,null,null,null,"no!"]
[null,null,null,null,null,null,null,null,null,null,null,null,null,null,null,null,null,null,null,"no!"]
[null,null,null,null,null,null,null,null,null,null,null,null,null,null,null,null,null,null,null,"no!"]
[null,null,null,null,null,null,null,null,null,null,null,null,null,null,null,null,null,null,null,"no!"]
[null,null,null,null,null,null,null,null,null,null,null,null,null,null,null,null,null,null,null,"no!"]
[null,null,null,null,null,null,null,null,null,null,null,null,null,null,null,null,null,null,null,"no!"]
[null,null,null,null,null,null,null,null,null,null,null,null,null,null,null,null,null,null,null,"no!"]
[null,null,null,null,null,null,null,null,null,null,null,null,null,null,null,null,null,null,null,"no!"]
[null,null,null,null,null,null,null,null,null,null,null,null,null,null,null,null,null,null,null,"no!"]
[null,null,null,null,null,null,null,null,null,null,null,null,null,null,null,null,null,null,null,"no!"]
[null,null,null,null,null,null,null,null,null,null,null,null,null,null,null,null,null,null,null,"no!"]
[null,null,null,null,null,null,null,null,null,null,null,null,null,null,null,null,null,null,null,"no!"]
[null,null,null,null,null,null,null,null,null,null,null,null,null,null,null,null,null,null,null,"no!"]
[null,null,null,null,null,null,null,null,null,null,null,null,null,null,null,null,null,null,null,"no!"]
[null,null,null,null,null,null,null,null,null,null,null,null,null,null,null,null,null,null,null,"no!"]
[null,null,null,null,null,null,null,null,null,null,null,null,null,null,null,null,null,null,null,"no!"]
[null,null,null,null,null,null,null,null,null,null,null,null,null,null,null,null,null,null,null,"no!"]
[null,null,null,null,null,null,null,null,null,null,null,null,null,null,null,null,null,null,null,"no!"]
[null,null,null,null,null,null,null,null,null,null,null,null,null,null,null,null,null,null,null,{"$f":"IF(AND(K210=$T$2,L210=$U$2),\"YES!!\",\"no!\")","v":"no!"}]
[null,null,null,null,null,null,null,null,null,null,null,null,null,null,null,null,null,null,null,"no!"]
[null,"Sports System © McRopod Concepts 2024",null,null,null,null,null,null,null,null,null,null,null,null,null,null,null,null,null,"no!"]
[null,null,26,"2025-04-17","19:35:00","19:35:00","Suncorp Stadium","Brisbane Roar FC","v","Western United FC",null,null,null,null,"BRI","WUT",null,3,9,"no!"]
[null,null,26,"2025-04-18","19:35:00","19:05:00","Coopers Stadium","Adelaide United","v","Wellington Phoenix",null,null,null,null,"ADU","PHX",null,12,8,"no!"]
[null,null,26,"2025-04-19","17:00:00","17:00:00","AAMI Park","Melbourne Victory","v","Auckland FC",null,null,null,null,"VIC","UCK",null,13,2,"no!"]
[null,null,26,"2025-04-19","19:35:00","19:35:00","CommBank Stadium","Western Sydney Wanderers FC","v","Melbourne City FC",null,null,null,null,"WSW","MCT",null,6,5,"no!"]
[null,null,26,"2025-04-20","17:00:00","17:00:00","Industree Group Stadium","Central Coast Mariners","v","Macarthur FC",null,null,null,null,"CCM","MAC",null,1,10,"no!"]
[null,null,26,"2025-04-20","15:00:00","15:00:00","Allianz Stadium","Sydney FC","v","Newcastle Jets",null,null,null,null,"SYD","NEW",null,7,4,"no!"]
[null,null,null,null,null,null,null,"Perth Glory",null,"BYE",null,null,null,null,null,null,null,null,null,"no!"]
[null,null,25,"2025-04-25","19:35:00","19:35:00","Campbelltown Stadium","Macarthur FC","v","Melbourne Victory",null,null,null,null,"MAC","VIC",null,10,13,"no!"]
[null,null,25,"2025-04-26","15:00:00","15:00:00","Suncorp Stadium","Brisbane Roar FC","v","Wellington Phoenix",null,null,null,null,"BRI","PHX",null,3,8,"no!"]
[null,null,25,"2025-04-26","17:00:00","17:00:00","McDonald Jones Stadium","Newcastle Jets","v","Western Sydney Wanderers FC",null,null,null,null,"NEW","WSW",null,4,6,"no!"]
[null,null,25,"2025-04-26","19:35:00","19:35:00","AAMI Park","Melbourne City FC","v","Adelaide United",null,null,null,null,"MCT","ADU",null,5,12,"no!"]
[null,null,25,"2025-04-27","15:00:00","17:00:00","GO Media Stadium","Auckland FC","v","Perth Glory",null,null,null,null,"UCK","GLO",null,2,11,"no!"]
[null,null,25,"2025-04-27","17:00:00","17:00:00","Ironbark Fields","Western United FC","v","Sydney FC",null,null,null,null,"WUT","SYD",null,9,7,"no!"]
[null,null,null,null,null,null,null,"Central Coast Mariners",null,"BYE",null,null,null,null,null,null,null,null,null,"no!"]
[null,null,25,"2025-05-02","17:30:00","19:30:00","Sky Stadium","Wellington Phoenix","v","Perth Glory",null,null,null,null,"PHX","GLO",null,8,11,"no!"]
[null,null,25,"2025-05-02","19:35:00","19:35:00","Industree Group Stadium","Central Coast Mariners","v","Brisbane Roar FC",null,null,null,null,"CCM","BRI",null,1,3,"no!"]
[null,null,25,"2025-05-03","17:00:00","17:00:00","AAMI Park","Melbourne City FC","v","Sydney FC",null,null,null,null,"MCT","SYD",null,5,7,"no!"]
[null,null,25,"2025-05-03","18:00:00","18:00:00","Ironbark Fields","Western United FC","v","Auckland FC",null,null,null,null,"WUT","UCK",null,9,2,"no!"]
[null,null,25,"2025-05-03","19:35:00","19:35:00","Campbelltown Stadium","Macarthur FC","v","Western Sydney Wanderers FC",null,null,null,null,"MAC","WSW",null,10,6,"no!"]
[null,null,25,"2025-05-04","17:00:00","17:00:00","AAMI Park","Melbourne Victory","v","Newcastle Jets",null,null,null,null,"VIC","NEW",null,13,4,"no!"]
[null,null,null,null,null,null,null,"Adelaide United",null,"BYE",null,null,null,null,null,null,null,null,null,"no!"]

{"sheet":"Grid","index":1,"n_rows":83,"n_cols":69,"rows_kept":83,"cut":false,"hidden":false,"merged":[]}
["             ",null,null,null,null,null,null,null,null,null,null,null,null,null,null,null,null,null,null,null,null,null,null,null,null,null,null,null,null,null,null,null,null,null,null,null,null,null,null,null,null,null,null,null,null,null,"Home",null,null,null,null,null,null,null,null,"Away"]
[null,null,{"$f":"IF(AR67=(156),\"Season Complete\",\"Season Incomplete\")","v":"Season Incomplete"},null,{"$f":"C3","v":"Central Coast Mariners"},null,null,{"$f":"C4","v":"Auckland FC"},null,null,{"$f":"C5","v":"Newcastle Jets"},null,null,{"$f":"C6","v":"Western Sydney Wanderers FC"},null,null,{"$f":"C7","v":"Wellington Phoenix"},null,null,{"$f":"C8","v":"Macarthur FC"},null,null,{"$f":"C9","v":"Adelaide United"},null,null,{"$f":"C10","v":"Melbourne Victory"},null,null,{"$f":"C11","v":"Brisbane Roar FC"},null,null,{"$f":"C12","v":"Melbourne City FC"},null,null,{"$f":"C13","v":"Sydney FC"},null,null,{"$f":"C14","v":"Western United FC"},null,null,{"$f":"C15","v":"Perth Glory"},null,null,"P","W","D","L","F","A","GD","Pts",null,"P","W","D","L","F","A","GD","Pts",null,"P","W","D","L","F","A","GD","Pts"]
[null,{"$f":"Fixtures!O3","v":"CCM"},{"$f":"Fixtures!H3","v":"Central Coast Mariners"},null,null,{"$f":"IF(D3=\"\",\"\",IF(E3=\"\",\"\",IF(D3>E3,\"W\",IF(D3=E3,\"D\",IF(D3<E3,\"L\")))))","v":""},{"$f":"IF(Fixtures!$K$71=\"\",\"\",Fixtures!$K$71)","v":""},{"$f":"IF(Fixtures!$L$71=\"\",\"\",Fixtures!$L$71)","v":""},{"$f":"IF(G3=\"\",\"\",IF(H3=\"\",\"\",IF(G3>H3,\"W\",IF(G3=H3,\"D\",IF(G3<H3,\"L\")))))","v":""},{"$f":"IF(Fixtures!$K$124=\"\",\"\",Fixtures!$K$124)","v":""},{"$f":"IF(Fixtures!$L$124=\"\",\"\",Fixtures!$L$124)","v":""},{"$f":"IF(J3=\"\",\"\",IF(K3=\"\",\"\",IF(J3>K3,\"W\",IF(J3=K3,\"D\",IF(J3<K3,\"L\")))))","v":""},{"$f":"IF(Fixtures!$K$145=\"\",\"\",Fixtures!$K$145)","v":""},{"$f":"IF(Fixtures!$L$145=\"\",\"\",Fixtures!$L$145)","v":""},{"$f":"IF(M3=\"\",\"\",IF(N3=\"\",\"\",IF(M3>N3,\"W\",IF(M3=N3,\"D\",IF(M3<N3,\"L\")))))","v":""},{"$f":"IF(Fixtures!$K$29=\"\",\"\",Fixtures!$K$29)","v":""},{"$f":"IF(Fixtures!$L$29=\"\",\"\",Fixtures!$L$29)","v":""},{"$f":"IF(P3=\"\",\"\",IF(Q3=\"\",\"\",IF(P3>Q3,\"W\",IF(P3=Q3,\"D\",IF(P3<Q3,\"L\")))))","v":""},{"$f":"IF(Fixtures!$K$217=\"\",\"\",Fixtures!$K$217)","v":""},{"$f":"IF(Fixtures!$L$217=\"\",\"\",Fixtures!$L$217)","v":""},{"$f":"IF(S3=\"\",\"\",IF(T3=\"\",\"\",IF(S3>T3,\"W\",IF(S3=T3,\"D\",IF(S3<T3,\"L\")))))","v":""},{"$f":"IF(Fixtures!$K$54=\"\",\"\",Fixtures!$K$54)","v":""},{"$f":"IF(Fixtures!$L$54=\"\",\"\",Fixtures!$L$54)","v":""},{"$f":"IF(V3=\"\",\"\",IF(W3=\"\",\"\",IF(V3>W3,\"W\",IF(V3=W3,\"D\",IF(V3<W3,\"L\")))))","v":""},{"$f":"IF(Fixtures!$K$3=\"\",\"\",Fixtures!$K$3)","v":0},{"$f":"IF(Fixtures!$L$3=\"\",\"\",Fixtures!$L$3)","v":0},{"$f":"IF(Y3=\"\",\"\",IF(Z3=\"\",\"\",IF(Y3>Z3,\"W\",IF(Y3=Z3,\"D\",IF(Y3<Z3,\"L\")))))","v":"D"},{"$f":"IF(Fixtures!$K$228=\"\",\"\",Fixtures!$K$228)","v":""},{"$f":"IF(Fixtures!$L$228=\"\",\"\",Fixtures!$L$228)","v":""},{"$f":"IF(AB3=\"\",\"\",IF(AC3=\"\",\"\",IF(AB3>AC3,\"W\",IF(AB3=AC3,\"D\",IF(AB3<AC3,\"L\")))))","v":""},{"$f":"IF(Fixtures!$K$76=\"\",\"\",Fixtures!$K$76)","v":""},{"$f":"IF(Fixtures!$L$76=\"\",\"\",Fixtures!$L$76)","v":""},{"$f":"IF(AE3=\"\",\"\",IF(AF3=\"\",\"\",IF(AE3>AF3,\"W\",IF(AE3=AF3,\"D\",IF(AE3<AF3,\"L\")))))","v":""},{"$f":"IF(Fixtures!$K$51=\"\",\"\",Fixtures!$K$51)","v":""},{"$f":"IF(Fixtures!$L$51=\"\",\"\",Fixtures!$L$51)","v":""},{"$f":"IF(AH3=\"\",\"\",IF(AI3=\"\",\"\",IF(AH3>AI3,\"W\",IF(AH3=AI3,\"D\",IF(AH3<AI3,\"L\")))))","v":""},{"$f":"IF(Fixtures!$K$151=\"\",\"\",Fixtures!$K$151)","v":""},{"$f":"IF(Fixtures!$L$151=\"\",\"\",Fixtures!$L$151)","v":""},{"$f":"IF(AK3=\"\",\"\",IF(AL3=\"\",\"\",IF(AK3>AL3,\"W\",IF(AK3=AL3,\"D\",IF(AK3<AL3,\"L\")))))","v":""},{"$f":"IF(Fixtures!$K$20=\"\",\"\",Fixtures!$K$20)","v":""},{"$f":"IF(Fixtures!$L$20=\"\",\"\",Fixtures!$L$20)","v":""},{"$f":"IF(AN3=\"\",\"\",IF(AO3=\"\",\"\",IF(AN3>AO3,\"W\",IF(AN3=AO3,\"D\",IF(AN3<AO3,\"L\")))))","v":""},{"$f":"C3","v":"Central Coast Mariners"},{"$f":"SUM(AS3:AU3)","v":1},{"$f":"IF(F3=\"W\",1,0)+IF(I3=\"W\",1,0)+IF(L3=\"W\",1,0)+IF(O3=\"W\",1,0)+IF(R3=\"W\",1,0)+IF(U3=\"W\",1,0)+IF(X3=\"W\",1,0)+IF(AA3=\"W\",1,0)+IF(AD3=\"W\",1,0)+IF(AG3=\"W\",1,0)+IF(AJ3=\"W\",1,0)+IF(AM3=\"W\",1,0)+IF(AP3=\"W\",1,0)","v":0},{"$f":"IF(F3=\"D\",1,0)+IF(I3=\"D\",1,0)+IF(L3=\"D\",1,0)+IF(O3=\"D\",1,0)+IF(R3=\"D\",1,0)+IF(U3=\"D\",1,0)+IF(X3=\"D\",1,0)+IF(AA3=\"D\",1,0)+IF(AD3=\"D\",1,0)+IF(AG3=\"D\",1,0)+IF(AJ3=\"D\",1,0)+IF(AM3=\"D\",1,0)+IF(AP3=\"D\",1,0)","v":1},{"$f":"IF(F3=\"L\",1,0)+IF(I3=\"L\",1,0)+IF(L3=\"L\",1,0)+IF(O3=\"L\",1,0)+IF(R3=\"L\",1,0)+IF(U3=\"L\",1,0)+IF(X3=\"L\",1,0)+IF(AA3=\"L\",1,0)+IF(AD3=\"L\",1,0)+IF(AG3=\"L\",1,0)+IF(AJ3=\"L\",1,0)+IF(AM3=\"L\",1,0)+IF(AP3=\"L\",1,0)","v":0},{"$f":"SUM(D3)+SUM(G3)+SUM(J3)+SUM(M3)+SUM(P3)+SUM(S3)+SUM(V3)+SUM(Y3)+SUM(AB3)+SUM(AE3)+SUM(AH3)+SUM(AK3)+SUM(AN3)","v":0},{"$f":"SUM(E3)+SUM(H3)+SUM(K3)+SUM(N3)+SUM(Q3)+SUM(T3)+SUM(W3)+SUM(Z3)+SUM(AC3)+SUM(AF3)+SUM(AI3)+SUM(AL3)+SUM(AO3)","v":0},{"$f":"AV3-AW3","v":0},{"$f":"AS3*3+AT3","v":1},null,{"$f":"SUM(BB3:BD3)","v":0},{"$f":"D16","v":0},{"$f":"E16","v":0},{"$f":"F16","v":0},{"$f":"E17","v":0},{"$f":"F17","v":0},{"$f":"BE3-BF3","v":0},{"$f":"BB3*3+BC3","v":0},null,{"$f":"AR3+BA3","v":1},{"$f":"AS3+BB3","v":0},{"$f":"AT3+BC3","v":1},0,0,0,0,1]
[null,{"$f":"Fixtures!O4","v":"UCK"},{"$f":"Fixtures!H4","v":"Auckland FC"},{"$f":"IF(Fixtures!$K$169=\"\",\"\",Fixtures!$K$169)","v":""},{"$f":"IF(Fixtures!$L$169=\"\",\"\",Fixtures!$L$169)","v":""},"",null,null,"",{"$f":"IF(Fixtures!$K$40=\"\",\"\",Fixtures!$K$40)","v":""},{"$f":"IF(Fixtures!$L$40=\"\",\"\",Fixtures!$L$40)","v":""},"",{"$f":"IF(Fixtures!$K$180=\"\",\"\",Fixtures!$K$180)","v":""},{"$f":"IF(Fixtures!$L$180=\"\",\"\",Fixtures!$L$180)","v":""},"",{"$f":"IF(Fixtures!$K$144=\"\",\"\",Fixtures!$K$144)","v":""},{"$f":"IF(Fixtures!$L$144=\"\",\"\",Fixtures!$L$144)","v":""},"",{"$f":"IF(Fixtures!$K$122=\"\",\"\",Fixtures!$K$122)","v":""},{"$f":"IF(Fixtures!$L$122=\"\",\"\",Fixtures!$L$122)","v":""},"",{"$f":"IF(Fixtures!$K$152=\"\",\"\",Fixtures!$K$152)","v":""},{"$f":"IF(Fixtures!$L$152=\"\",\"\",Fixtures!$L$152)","v":""},{"$f":"IF(V4=\"\",\"\",IF(W4=\"\",\"\",IF(V4>W4,\"W\",IF(V4=W4,\"D\",IF(V4<W4,\"L\")))))","v":""},{"$f":"IF(Fixtures!$K$77=\"\",\"\",Fixtures!$K$77)","v":""},{"$f":"IF(Fixtures!$L$77=\"\",\"\",Fixtures!$L$77)","v":""},"",{"$f":"IF(Fixtures!$K$4=\"\",\"\",Fixtures!$K$4)","v":2},{"$f":"IF(Fixtures!$L$4=\"\",\"\",Fixtures!$L$4)","v":0},"W",{"$f":"IF(Fixtures!$K$107=\"\",\"\",Fixtures!$K$107)","v":""},{"$f":"IF(Fixtures!$L$107=\"\",\"\",Fixtures!$L$107)","v":""},"",{"$f":"IF(Fixtures!$K$14=\"\",\"\",Fixtures!$K$14)","v":""},{"$f":"IF(Fixtures!$L$14=\"\",\"\",Fixtures!$L$14)","v":""},"",{"$f":"IF(Fixtures!$K$62=\"\",\"\",Fixtures!$K$62)","v":""},{"$f":"IF(Fixtures!$L$62=\"\",\"\",Fixtures!$L$62)","v":""},"",{"$f":"IF(Fixtures!$K$224=\"\",\"\",Fixtures!$K$224)","v":""},{"$f":"IF(Fixtures!$L$224=\"\",\"\",Fixtures!$L$224)","v":""},"",{"$f":"C4","v":"Auckland FC"},{"$f":"SUM(AS4:AU4)","v":1},{"$f":"IF(F4=\"W\",1,0)+IF(I4=\"W\",1,0)+IF(L4=\"W\",1,0)+IF(O4=\"W\",1,0)+IF(R4=\"W\",1,0)+IF(U4=\"W\",1,0)+IF(X4=\"W\",1,0)+IF(AA4=\"W\",1,0)+IF(AD4=\"W\",1,0)+IF(AG4=\"W\",1,0)+IF(AJ4=\"W\",1,0)+IF(AM4=\"W\",1,0)+IF(AP4=\"W\",1,0)","v":1},{"$f":"IF(F4=\"D\",1,0)+IF(I4=\"D\",1,0)+IF(L4=\"D\",1,0)+IF(O4=\"D\",1,0)+IF(R4=\"D\",1,0)+IF(U4=\"D\",1,0)+IF(X4=\"D\",1,0)+IF(AA4=\"D\",1,0)+IF(AD4=\"D\",1,0)+IF(AG4=\"D\",1,0)+IF(AJ4=\"D\",1,0)+IF(AM4=\"D\",1,0)+IF(AP4=\"D\",1,0)","v":0},{"$f":"IF(F4=\"L\",1,0)+IF(I4=\"L\",1,0)+IF(L4=\"L\",1,0)+IF(O4=\"L\",1,0)+IF(R4=\"L\",1,0)+IF(U4=\"L\",1,0)+IF(X4=\"L\",1,0)+IF(AA4=\"L\",1,0)+IF(AD4=\"L\",1,0)+IF(AG4=\"L\",1,0)+IF(AJ4=\"L\",1,0)+IF(AM4=\"L\",1,0)+IF(AP4=\"L\",1,0)","v":0},{"$f":"SUM(D4)+SUM(G4)+SUM(J4)+SUM(M4)+SUM(P4)+SUM(S4)+SUM(V4)+SUM(Y4)+SUM(AB4)+SUM(AE4)+SUM(AH4)+SUM(AK4)+SUM(AN4)","v":2},{"$f":"SUM(E4)+SUM(H4)+SUM(K4)+SUM(N4)+SUM(Q4)+SUM(T4)+SUM(W4)+SUM(Z4)+SUM(AC4)+SUM(AF4)+SUM(AI4)+SUM(AL4)+SUM(AO4)","v":0},{"$f":"AV4-AW4","v":2},{"$f":"AS4*3+AT4","v":3},null,{"$f":"SUM(BB4:BD4)","v":0},{"$f":"G16","v":0},{"$f":"H16","v":0},0,{"$f":"H17","v":0},{"$f":"I17","v":0},{"$f":"BE4-BF4","v":0},{"$f":"BB4*3+BC4","v":0},null,{"$f":"AR4+BA4","v":1},{"$f":"AS4+BB4","v":1},{"$f":"AT4+BC4","v":0},{"$f":"AU4+BD4","v":0},{"$f":"AV4+BE4","v":2},{"$f":"AW4+BF4","v":0},{"$f":"AX4+BG4","v":2},{"$f":"AY4+BH4","v":3}]
[null,{"$f":"Fixtures!O5","v":"NEW"},{"$f":"Fixtures!H5","v":"Newcastle Jets"},{"$f":"IF(Fixtures!$K$33=\"\",\"\",Fixtures!$K$33)","v":""},{"$f":"IF(Fixtures!$L$33=\"\",\"\",Fixtures!$L$33)","v":""},"",{"$f":"IF(Fixtures!$K$161=\"\",\"\",Fixtures!$K$161)","v":""},{"$f":"IF(Fixtures!$L$161=\"\",\"\",Fixtures!$L$161)","v":""},"",null,null,"",{"$f":"IF(Fixtures!$K$222=\"\",\"\",Fixtures!$K$222)","v":""},{"$f":"IF(Fixtures!$L$222=\"\",\"\",Fixtures!$L$222)","v":""},"",{"$f":"IF(Fixtures!$K$184=\"\",\"\",Fixtures!$K$184)","v":""},{"$f":"IF(Fixtures!$L$184=\"\",\"\",Fixtures!$L$184)","v":""},"",{"$f":"IF(Fixtures!$K$96=\"\",\"\",Fixtures!$K$96)","v":""},{"$f":"IF(Fixtures!$L$96=\"\",\"\",Fixtures!$L$96)","v":""},"",{"$f":"IF(Fixtures!$K$49=\"\",\"\",Fixtures!$K$49)","v":""},{"$f":"IF(Fixtures!$L$49=\"\",\"\",Fixtures!$L$49)","v":""},"",{"$f":"IF(Fixtures!$K$130=\"\",\"\",Fixtures!$K$130)","v":""},{"$f":"IF(Fixtures!$L$130=\"\",\"\",Fixtures!$L$130)","v":""},"",{"$f":"IF(Fixtures!$K$143=\"\",\"\",Fixtures!$K$143)","v":""},{"$f":"IF(Fixtures!$L$143=\"\",\"\",Fixtures!$L$143)","v":""},"",{"$f":"IF(Fixtures!$K$5=\"\",\"\",Fixtures!$K$5)","v":0},{"$f":"IF(Fixtures!$L$5=\"\",\"\",Fixtures!$L$5)","v":1},"L",{"$f":"IF(Fixtures!$K$87=\"\",\"\",Fixtures!$K$87)","v":""},{"$f":"IF(Fixtures!$L$87=\"\",\"\",Fixtures!$L$87)","v":""},"",{"$f":"IF(Fixtures!$K$170=\"\",\"\",Fixtures!$K$170)","v":""},{"$f":"IF(Fixtures!$L$170=\"\",\"\",Fixtures!$L$170)","v":""},"",{"$f":"IF(Fixtures!$K$116=\"\",\"\",Fixtures!$K$116)","v":""},{"$f":"IF(Fixtures!$L$116=\"\",\"\",Fixtures!$L$116)","v":""},"","Newcastle Jets",{"$f":"SUM(AS5:AU5)","v":1},0,0,1,0,1,-1,0,null,0,{"$f":"J16","v":0},{"$f":"K16","v":0},0,{"$f":"K17","v":0},{"$f":"L17","v":0},0,0,null,{"$f":"AR5+BA5","v":1},{"$f":"AS5+BB5","v":0},0,1,0,1,{"$f":"AX5+BG5","v":-1},0]
[null,{"$f":"Fixtures!O6","v":"WSW"},{"$f":"Fixtures!H6","v":"Western Sydney Wanderers FC"},{"$f":"IF(Fixtures!$K$106=\"\",\"\",Fixtures!$K$106)","v":""},{"$f":"IF(Fixtures!$L$106=\"\",\"\",Fixtures!$L$106)","v":""},"",{"$f":"IF(Fixtures!$K$118=\"\",\"\",Fixtures!$K$118)","v":""},{"$f":"IF(Fixtures!$L$118=\"\",\"\",Fixtures!$L$118)","v":""},"",{"$f":"IF(Fixtures!$K$25=\"\",\"\",Fixtures!$K$25)","v":""},{"$f":"IF(Fixtures!$L$25=\"\",\"\",Fixtures!$L$25)","v":""},"",null,null,"",{"$f":"IF(Fixtures!$K$65=\"\",\"\",Fixtures!$K$65)","v":""},{"$f":"IF(Fixtures!$L$65=\"\",\"\",Fixtures!$L$65)","v":""},"",{"$f":"IF(Fixtures!$K$139=\"\",\"\",Fixtures!$K$139)","v":""},{"$f":"IF(Fixtures!$L$139=\"\",\"\",Fixtures!$L$139)","v":""},"",{"$f":"IF(Fixtures!$K$21=\"\",\"\",Fixtures!$K$21)","v":""},{"$f":"IF(Fixtures!$L$21=\"\",\"\",Fixtures!$L$21)","v":""},"",{"$f":"IF(Fixtures!$K$167=\"\",\"\",Fixtures!$K$167)","v":""},{"$f":"IF(Fixtures!$L$167=\"\",\"\",Fixtures!$L$167)","v":""},"",{"$f":"IF(Fixtures!$K$57=\"\",\"\",Fixtures!$K$57)","v":""},{"$f":"IF(Fixtures!$L$57=\"\",\"\",Fixtures!$L$57)","v":""},"",{"$f":"IF(Fixtures!$K$216=\"\",\"\",Fixtures!$K$216)","v":""},{"$f":"IF(Fixtures!$L$216=\"\",\"\",Fixtures!$L$216)","v":""},"",{"$f":"IF(Fixtures!$K$6=\"\",\"\",Fixtures!$K$6)","v":1},{"$f":"IF(Fixtures!$L$6=\"\",\"\",Fixtures!$L$6)","v":2},"L",{"$f":"IF(Fixtures!$K$191=\"\",\"\",Fixtures!$K$191)","v":""},{"$f":"IF(Fixtures!$L$191=\"\",\"\",Fixtures!$L$191)","v":""},"",{"$f":"IF(Fixtures!$K$155=\"\",\"\",Fixtures!$K$155)","v":""},{"$f":"IF(Fixtures!$L$155=\"\",\"\",Fixtures!$L$155)","v":""},"","Western Sydney Wanderers FC",1,0,0,1,1,2,-1,0,null,0,{"$f":"M16","v":0},{"$f":"N16","v":0},0,{"$f":"N17","v":0},{"$f":"O17","v":0},0,0,null,1,0,0,1,1,2,-1,0]
[null,{"$f":"Fixtures!O7","v":"PHX"},{"$f":"Fixtures!H7","v":"Wellington Phoenix"},{"$f":"IF(Fixtures!$K$114=\"\",\"\",Fixtures!$K$114)","v":""},{"$f":"IF(Fixtures!$L$114=\"\",\"\",Fixtures!$L$114)","v":""},"",{"$f":"IF(Fixtures!$K$19=\"\",\"\",Fixtures!$K$19)","v":""},{"$f":"IF(Fixtures!$L$19=\"\",\"\",Fixtures!$L$19)","v":""},"",{"$f":"IF(Fixtures!$K$70=\"\",\"\",Fixtures!$K$70)","v":""},{"$f":"IF(Fixtures!$L$70=\"\",\"\",Fixtures!$L$70)","v":""},"",{"$f":"IF(Fixtures!$K$173=\"\",\"\",Fixtures!$K$173)","v":""},{"$f":"IF(Fixtures!$L$173=\"\",\"\",Fixtures!$L$173)","v":""},"",null,null,"",{"$f":"IF(Fixtures!$K$55=\"\",\"\",Fixtures!$K$55)","v":""},{"$f":"IF(Fixtures!$L$55=\"\",\"\",Fixtures!$L$55)","v":""},"",{"$f":"IF(Fixtures!$K$92=\"\",\"\",Fixtures!$K$92)","v":""},{"$f":"IF(Fixtures!$L$92=\"\",\"\",Fixtures!$L$92)","v":""},"",{"$f":"IF(Fixtures!$K$187=\"\",\"\",Fixtures!$K$187)","v":""},{"$f":"IF(Fixtures!$L$187=\"\",\"\",Fixtures!$L$187)","v":""},"",{"$f":"IF(Fixtures!$K$127=\"\",\"\",Fixtures!$K$127)","v":""},{"$f":"IF(Fixtures!$L$127=\"\",\"\",Fixtures!$L$127)","v":""},"",{"$f":"IF(Fixtures!$K$150=\"\",\"\",Fixtures!$K$150)","v":""},{"$f":"IF(Fixtures!$L$150=\"\",\"\",Fixtures!$L$150)","v":""},"",{"$f":"IF(Fixtures!$K$99=\"\",\"\",Fixtures!$K$99)","v":""},{"$f":"IF(Fixtures!$L$99=\"\",\"\",Fixtures!$L$99)","v":""},"",{"$f":"IF(Fixtures!$K$7=\"\",\"\",Fixtures!$K$7)","v":1},{"$f":"IF(Fixtures!$L$7=\"\",\"\",Fixtures!$L$7)","v":1},"D",{"$f":"IF(Fixtures!$K$227=\"\",\"\",Fixtures!$K$227)","v":""},{"$f":"IF(Fixtures!$L$227=\"\",\"\",Fixtures!$L$227)","v":""},"","Wellington Phoenix",{"$f":"SUM(AS7:AU7)","v":1},0,1,0,1,1,0,1,null,0,{"$f":"P16","v":0},{"$f":"Q16","v":0},0,{"$f":"Q17","v":0},{"$f":"R17","v":0},0,0,null,1,0,1,0,1,1,0,1]
[null,{"$f":"Fixtures!O8","v":"MAC"},{"$f":"Fixtures!H8","v":"Macarthur FC"},{"$f":"IF(Fixtures!$K$66=\"\",\"\",Fixtures!$K$66)","v":""},{"$f":"IF(Fixtures!$L$66=\"\",\"\",Fixtures!$L$66)","v":""},"",{"$f":"IF(Fixtures!$K$37=\"\",\"\",Fixtures!$K$37)","v":""},{"$f":"IF(Fixtures!$L$37=\"\",\"\",Fixtures!$L$37)","v":""},"",{"$f":"IF(Fixtures!$K$10=\"\",\"\",Fixtures!$K$10)","v":""},{"$f":"IF(Fixtures!$L$10=\"\",\"\",Fixtures!$L$10)","v":""},"",{"$f":"IF(Fixtures!$K$231=\"\",\"\",Fixtures!$K$231)","v":""},{"$f":"IF(Fixtures!$L$231=\"\",\"\",Fixtures!$L$231)","v":""},"",{"$f":"IF(Fixtures!$K$111=\"\",\"\",Fixtures!$K$111)","v":""},{"$f":"IF(Fixtures!$L$111=\"\",\"\",Fixtures!$L$111)","v":""},"",null,null,"",{"$f":"IF(Fixtures!$K$89=\"\",\"\",Fixtures!$K$89)","v":""},{"$f":"IF(Fixtures!$L$89=\"\",\"\",Fixtures!$L$89)","v":""},"",{"$f":"IF(Fixtures!$K$220=\"\",\"\",Fixtures!$K$220)","v":""},{"$f":"IF(Fixtures!$L$220=\"\",\"\",Fixtures!$L$220)","v":""},{"$f":"IF(Y8=\"\",\"\",IF(Z8=\"\",\"\",IF(Y8>Z8,\"W\",IF(Y8=Z8,\"D\",IF(Y8<Z8,\"L\")))))","v":""},{"$f":"IF(Fixtures!$K$43=\"\",\"\",Fixtures!$K$43)","v":""},{"$f":"IF(Fixtures!$L$43=\"\",\"\",Fixtures!$L$43)","v":""},"",{"$f":"IF(Fixtures!$K$117=\"\",\"\",Fixtures!$K$117)","v":""},{"$f":"IF(Fixtures!$L$117=\"\",\"\",Fixtures!$L$117)","v":""},"",{"$f":"IF(Fixtures!$K$154=\"\",\"\",Fixtures!$K$154)","v":""},{"$f":"IF(Fixtures!$L$154=\"\",\"\",Fixtures!$L$154)","v":""},"",{"$f":"IF(Fixtures!$K$132=\"\",\"\",Fixtures!$K$132)","v":""},{"$f":"IF(Fixtures!$L$132=\"\",\"\",Fixtures!$L$132)","v":""},"",{"$f":"IF(Fixtures!$K$8=\"\",\"\",Fixtures!$K$8)","v":6},{"$f":"IF(Fixtures!$L$8=\"\",\"\",Fixtures!$L$8)","v":1},"W","Macarthur FC",{"$f":"SUM(AS8:AU8)","v":1},1,0,0,6,1,5,3,null,0,{"$f":"S16","v":0},{"$f":"T16","v":0},0,{"$f":"T17","v":0},{"$f":"U17","v":0},0,0,null,{"$f":"AR8+BA8","v":1},{"$f":"AS8+BB8","v":1},0,0,6,1,5,3]
[null,{"$f":"Fixtures!O11","v":"ADU"},{"$f":"Fixtures!H9","v":"Adelaide United"},{"$f":"IF(Fixtures!$K$11=\"\",\"\",Fixtures!$K$11)","v":""},{"$f":"IF(Fixtures!$L$11=\"\",\"\",Fixtures!$L$11)","v":""},"",{"$f":"IF(Fixtures!$K$103=\"\",\"\",Fixtures!$K$103)","v":""},{"$f":"IF(Fixtures!$L$103=\"\",\"\",Fixtures!$L$103)","v":""},"",{"$f":"IF(Fixtures!$K$138=\"\",\"\",Fixtures!$K$138)","v":""},{"$f":"IF(Fixtures!$L$138=\"\",\"\",Fixtures!$L$138)","v":""},"",{"$f":"IF(Fixtures!$K$68=\"\",\"\",Fixtures!$K$68)","v":""},{"$f":"IF(Fixtures!$L$68=\"\",\"\",Fixtures!$L$68)","v":""},"",{"$f":"IF(Fixtures!$K$214=\"\",\"\",Fixtures!$K$214)","v":""},{"$f":"IF(Fixtures!$L$214=\"\",\"\",Fixtures!$L$214)","v":""},"",{"$f":"IF(Fixtures!$K$165=\"\",\"\",Fixtures!$K$165)","v":""},{"$f":"IF(Fixtures!$L$165=\"\",\"\",Fixtures!$L$165)","v":""},"",null,null,null,{"$f":"IF(Fixtures!$K$110=\"\",\"\",Fixtures!$K$110)","v":""},{"$f":"IF(Fixtures!$L$110=\"\",\"\",Fixtures!$L$110)","v":""},"",{"$f":"IF(Fixtures!$K$158=\"\",\"\",Fixtures!$K$158)","v":""},{"$f":"IF(Fixtures!$L$158=\"\",\"\",Fixtures!$L$158)","v":""},"",{"$f":"IF(Fixtures!$K$128=\"\",\"\",Fixtures!$K$128)","v":""},{"$f":"IF(Fixtures!$L$128=\"\",\"\",Fixtures!$L$128)","v":""},"",{"$f":"IF(Fixtures!$K$183=\"\",\"\",Fixtures!$K$183)","v":""},{"$f":"IF(Fixtures!$L$183=\"\",\"\",Fixtures!$L$183)","v":""},"",{"$f":"IF(Fixtures!$K$28=\"\",\"\",Fixtures!$K$28)","v":""},{"$f":"IF(Fixtures!$L$28=\"\",\"\",Fixtures!$L$28)","v":""},"",{"$f":"IF(Fixtures!$K$39=\"\",\"\",Fixtures!$K$39)","v":""},{"$f":"IF(Fixtures!$L$39=\"\",\"\",Fixtures!$L$39)","v":""},"","Adelaide United",{"$f":"SUM(AS9:AU9)","v":0},0,0,0,0,0,0,0,null,{"$f":"SUM(BB9:BD9)","v":0},{"$f":"V16","v":0},{"$f":"W16","v":0},0,{"$f":"W17","v":0},{"$f":"X17","v":0},{"$f":"BE9-BF9","v":0},{"$f":"BB9*3+BC9","v":0},null,{"$f":"AR9+BA9","v":0},{"$f":"AS9+BB9","v":0},0,0,0,0,0,0]
[null,{"$f":"Fixtures!P3","v":"VIC"},{"$f":"Fixtures!J3","v":"Melbourne Victory"},{"$f":"IF(Fixtures!$K$160=\"\",\"\",Fixtures!$K$160)","v":""},{"$f":"IF(Fixtures!$L$160=\"\",\"\",Fixtures!$L$160)","v":""},"",{"$f":"IF(Fixtures!$K$215=\"\",\"\",Fixtures!$K$215)","v":""},{"$f":"IF(Fixtures!$L$215=\"\",\"\",Fixtures!$L$215)","v":""},"",{"$f":"IF(Fixtures!$K$232=\"\",\"\",Fixtures!$K$232)","v":""},{"$f":"IF(Fixtures!$L$232=\"\",\"\",Fixtures!$L$232)","v":""},"",{"$f":"IF(Fixtures!$K$88=\"\",\"\",Fixtures!$K$88)","v":""},{"$f":"IF(Fixtures!$L$88=\"\",\"\",Fixtures!$L$88)","v":""},"",{"$f":"IF(Fixtures!$K$135=\"\",\"\",Fixtures!$K$135)","v":""},{"$f":"IF(Fixtures!$L$135=\"\",\"\",Fixtures!$L$135)","v":""},"",{"$f":"IF(Fixtures!$K$22=\"\",\"\",Fixtures!$K$22)","v":""},{"$f":"IF(Fixtures!$L$22=\"\",\"\",Fixtures!$L$22)","v":""},"",{"$f":"IF(Fixtures!$K$175=\"\",\"\",Fixtures!$K$175)","v":""},{"$f":"IF(Fixtures!$L$175=\"\",\"\",Fixtures!$L$175)","v":""},{"$f":"IF(V10=\"\",\"\",IF(W10=\"\",\"\",IF(V10>W10,\"W\",IF(V10=W10,\"D\",IF(V10<W10,\"L\")))))","v":""},null,null,"",{"$f":"IF(Fixtures!$K$26=\"\",\"\",Fixtures!$K$26)","v":""},{"$f":"IF(Fixtures!$L$26=\"\",\"\",Fixtures!$L$26)","v":""},"",{"$f":"IF(Fixtures!$K$64=\"\",\"\",Fixtures!$K$64)","v":""},{"$f":"IF(Fixtures!$L$64=\"\",\"\",Fixtures!$L$64)","v":""},"",{"$f":"IF(Fixtures!$K$113=\"\",\"\",Fixtures!$K$113)","v":""},{"$f":"IF(Fixtures!$L$113=\"\",\"\",Fixtures!$L$113)","v":""},"",{"$f":"IF(Fixtures!$K$91=\"\",\"\",Fixtures!$K$91)","v":""},{"$f":"IF(Fixtures!$L$91=\"\",\"\",Fixtures!$L$91)","v":""},"",{"$f":"IF(Fixtures!$K$52=\"\",\"\",Fixtures!$K$52)","v":""},{"$f":"IF(Fixtures!$L$52=\"\",\"\",Fixtures!$L$52)","v":""},"","Melbourne Victory",0,0,0,0,0,0,0,0,null,1,{"$f":"Y16","v":0},{"$f":"Z16","v":1},0,{"$f":"Z17","v":0},{"$f":"AA17","v":0},0,1,null,1,0,1,0,0,0,0,1]
[null,{"$f":"Fixtures!P4","v":"BRI"},{"$f":"Fixtures!J4","v":"Brisbane Roar FC"},{"$f":"IF(Fixtures!$K$85=\"\",\"\",Fixtures!$K$85)","v":""},{"$f":"IF(Fixtures!$L$85=\"\",\"\",Fixtures!$L$85)","v":""},"",{"$f":"IF(Fixtures!$K$177=\"\",\"\",Fixtures!$K$177)","v":""},{"$f":"IF(Fixtures!$L$177=\"\",\"\",Fixtures!$L$177)","v":""},"",{"$f":"IF(Fixtures!$K$82=\"\",\"\",Fixtures!$K$82)","v":""},{"$f":"IF(Fixtures!$L$82=\"\",\"\",Fixtures!$L$82)","v":""},"",{"$f":"IF(Fixtures!$K$121=\"\",\"\",Fixtures!$K$121)","v":""},{"$f":"IF(Fixtures!$L$121=\"\",\"\",Fixtures!$L$121)","v":""},"",{"$f":"IF(Fixtures!$K$221=\"\",\"\",Fixtures!$K$221)","v":""},{"$f":"IF(Fixtures!$L$221=\"\",\"\",Fixtures!$L$221)","v":""},"",{"$f":"IF(Fixtures!$K$179=\"\",\"\",Fixtures!$K$179)","v":""},{"$f":"IF(Fixtures!$L$179=\"\",\"\",Fixtures!$L$179)","v":""},"",{"$f":"IF(Fixtures!$K$115=\"\",\"\",Fixtures!$K$115)","v":""},{"$f":"IF(Fixtures!$L$115=\"\",\"\",Fixtures!$L$115)","v":""},"",{"$f":"IF(Fixtures!$K$153=\"\",\"\",Fixtures!$K$153)","v":""},{"$f":"IF(Fixtures!$L$153=\"\",\"\",Fixtures!$L$153)","v":""},"",null,null,"",{"$f":"IF(Fixtures!$K$47=\"\",\"\",Fixtures!$K$47)","v":""},{"$f":"IF(Fixtures!$L$47=\"\",\"\",Fixtures!$L$47)","v":""},"",{"$f":"IF(Fixtures!$K$18=\"\",\"\",Fixtures!$K$18)","v":""},{"$f":"IF(Fixtures!$L$18=\"\",\"\",Fixtures!$L$18)","v":""},"",{"$f":"IF(Fixtures!$K$213=\"\",\"\",Fixtures!$K$213)","v":""},{"$f":"IF(Fixtures!$L$213=\"\",\"\",Fixtures!$L$213)","v":""},"",{"$f":"IF(Fixtures!$K$63=\"\",\"\",Fixtures!$K$63)","v":""},{"$f":"IF(Fixtures!$L$63=\"\",\"\",Fixtures!$L$63)","v":""},"","Brisbane Roar FC",0,0,0,0,0,0,0,0,null,1,{"$f":"AB16","v":0},{"$f":"AC16","v":0},1,{"$f":"AC17","v":0},{"$f":"AD17","v":2},-2,0,null,1,0,0,1,0,2,-2,0]
[null,{"$f":"Fixtures!P5","v":"MCT"},{"$f":"Fixtures!J5","v":"Melbourne City FC"},{"$f":"IF(Fixtures!$K$181=\"\",\"\",Fixtures!$K$181)","v":""},{"$f":"IF(Fixtures!$L$181=\"\",\"\",Fixtures!$L$181)","v":""},"",{"$f":"IF(Fixtures!$K$59=\"\",\"\",Fixtures!$K$59)","v":""},{"$f":"IF(Fixtures!$L$59=\"\",\"\",Fixtures!$L$59)","v":""},"",{"$f":"IF(Fixtures!$K$105=\"\",\"\",Fixtures!$K$105)","v":""},{"$f":"IF(Fixtures!$L$105=\"\",\"\",Fixtures!$L$105)","v":""},"",{"$f":"IF(Fixtures!$K$41=\"\",\"\",Fixtures!$K$41)","v":""},{"$f":"IF(Fixtures!$L$41=\"\",\"\",Fixtures!$L$41)","v":""},"",{"$f":"IF(Fixtures!$K$84=\"\",\"\",Fixtures!$K$84)","v":""},{"$f":"IF(Fixtures!$L$84=\"\",\"\",Fixtures!$L$84)","v":""},"",{"$f":"IF(Fixtures!$K$157=\"\",\"\",Fixtures!$K$157)","v":""},{"$f":"IF(Fixtures!$L$157=\"\",\"\",Fixtures!$L$157)","v":""},"",{"$f":"IF(Fixtures!$K$223=\"\",\"\",Fixtures!$K$223)","v":""},{"$f":"IF(Fixtures!$L$223=\"\",\"\",Fixtures!$L$223)","v":""},"",{"$f":"IF(Fixtures!$K$12=\"\",\"\",Fixtures!$K$12)","v":""},{"$f":"IF(Fixtures!$L$12=\"\",\"\",Fixtures!$L$12)","v":""},"",{"$f":"IF(Fixtures!$K$186=\"\",\"\",Fixtures!$K$186)","v":""},{"$f":"IF(Fixtures!$L$186=\"\",\"\",Fixtures!$L$186)","v":""},"",null,null,"",{"$f":"IF(Fixtures!$K$229=\"\",\"\",Fixtures!$K$229)","v":""},{"$f":"IF(Fixtures!$L$229=\"\",\"\",Fixtures!$L$229)","v":""},"",{"$f":"IF(Fixtures!$K$120=\"\",\"\",Fixtures!$K$120)","v":""},{"$f":"IF(Fixtures!$L$120=\"\",\"\",Fixtures!$L$120)","v":""},"",{"$f":"IF(Fixtures!$K$136=\"\",\"\",Fixtures!$K$136)","v":""},{"$f":"IF(Fixtures!$L$136=\"\",\"\",Fixtures!$L$136)","v":""},"","Melbourne City FC",0,0,0,0,0,0,0,0,null,1,{"$f":"AE16","v":1},{"$f":"AF16","v":0},0,{"$f":"AF17","v":1},{"$f":"AG17","v":0},1,3,null,1,1,0,0,1,0,1,3]
[null,{"$f":"Fixtures!P6","v":"SYD"},{"$f":"Fixtures!J6","v":"Sydney FC"},{"$f":"IF(Fixtures!$K$94=\"\",\"\",Fixtures!$K$94)","v":""},{"$f":"IF(Fixtures!$L$94=\"\",\"\",Fixtures!$L$94)","v":""},"",{"$f":"IF(Fixtures!$K$188=\"\",\"\",Fixtures!$K$188)","v":""},{"$f":"IF(Fixtures!$L$188=\"\",\"\",Fixtures!$L$188)","v":""},"",{"$f":"IF(Fixtures!$K$218=\"\",\"\",Fixtures!$K$218)","v":""},{"$f":"IF(Fixtures!$L$218=\"\",\"\",Fixtures!$L$218)","v":""},"",{"$f":"IF(Fixtures!$K$131=\"\",\"\",Fixtures!$K$131)","v":""},{"$f":"IF(Fixtures!$L$131=\"\",\"\",Fixtures!$L$131)","v":""},"",{"$f":"IF(Fixtures!$K$166=\"\",\"\",Fixtures!$K$166)","v":""},{"$f":"IF(Fixtures!$L$166=\"\",\"\",Fixtures!$L$166)","v":""},"",{"$f":"IF(Fixtures!$K$27=\"\",\"\",Fixtures!$K$27)","v":""},{"$f":"IF(Fixtures!$L$27=\"\",\"\",Fixtures!$L$27)","v":""},"",{"$f":"IF(Fixtures!$K$123=\"\",\"\",Fixtures!$K$123)","v":""},{"$f":"IF(Fixtures!$L$123=\"\",\"\",Fixtures!$L$123)","v":""},"",{"$f":"IF(Fixtures!$K$72=\"\",\"\",Fixtures!$K$72)","v":""},{"$f":"IF(Fixtures!$L$72=\"\",\"\",Fixtures!$L$72)","v":""},"",{"$f":"IF(Fixtures!$K$108=\"\",\"\",Fixtures!$K$108)","v":""},{"$f":"IF(Fixtures!$L$108=\"\",\"\",Fixtures!$L$108)","v":""},"",{"$f":"IF(Fixtures!$K$174=\"\",\"\",Fixtures!$K$174)","v":""},{"$f":"IF(Fixtures!$L$174=\"\",\"\",Fixtures!$L$174)","v":""},"",null,null,"",{"$f":"IF(Fixtures!$K$56=\"\",\"\",Fixtures!$K$56)","v":""},{"$f":"IF(Fixtures!$L$56=\"\",\"\",Fixtures!$L$56)","v":""},"",{"$f":"IF(Fixtures!$K$83=\"\",\"\",Fixtures!$K$83)","v":""},{"$f":"IF(Fixtures!$L$83=\"\",\"\",Fixtures!$L$83)","v":""},"","Sydney FC",{"$f":"SUM(AS13:AU13)","v":0},0,0,0,0,0,0,0,null,{"$f":"SUM(BB13:BD13)","v":1},{"$f":"AH16","v":1},{"$f":"AI16","v":0},0,{"$f":"AI17","v":2},{"$f":"AJ17","v":1},{"$f":"BE13-BF13","v":1},{"$f":"BB13*3+BC13","v":3},null,{"$f":"AR13+BA13","v":1},{"$f":"AS13+BB13","v":1},0,0,2,1,1,3]
[null,{"$f":"Fixtures!P7","v":"WUT"},{"$f":"Fixtures!J7","v":"Western United FC"},{"$f":"IF(Fixtures!$K$104=\"\",\"\",Fixtures!$K$104)","v":""},{"$f":"IF(Fixtures!$L$104=\"\",\"\",Fixtures!$L$104)","v":""},"",{"$f":"IF(Fixtures!$K$137=\"\",\"\",Fixtures!$K$137)","v":""},{"$f":"IF(Fixtures!$L$137=\"\",\"\",Fixtures!$L$137)","v":""},"",{"$f":"IF(Fixtures!$K$109=\"\",\"\",Fixtures!$K$109)","v":""},{"$f":"IF(Fixtures!$L$109=\"\",\"\",Fixtures!$L$109)","v":""},"",{"$f":"IF(Fixtures!$K$15=\"\",\"\",Fixtures!$K$15)","v":""},{"$f":"IF(Fixtures!$L$15=\"\",\"\",Fixtures!$L$15)","v":""},"",{"$f":"IF(Fixtures!$K$159=\"\",\"\",Fixtures!$K$159)","v":""},{"$f":"IF(Fixtures!$L$159=\"\",\"\",Fixtures!$L$159)","v":""},"",{"$f":"IF(Fixtures!$K$50=\"\",\"\",Fixtures!$K$50)","v":""},{"$f":"IF(Fixtures!$L$50=\"\",\"\",Fixtures!$L$50)","v":""},"",{"$f":"IF(Fixtures!$K$148=\"\",\"\",Fixtures!$K$148)","v":""},{"$f":"IF(Fixtures!$L$148=\"\",\"\",Fixtures!$L$148)","v":""},"",{"$f":"IF(Fixtures!$K$42=\"\",\"\",Fixtures!$K$42)","v":""},{"$f":"IF(Fixtures!$L$42=\"\",\"\",Fixtures!$L$42)","v":""},"",{"$f":"IF(Fixtures!$K$73=\"\",\"\",Fixtures!$K$73)","v":""},{"$f":"IF(Fixtures!$L$73=\"\",\"\",Fixtures!$L$73)","v":""},"",{"$f":"IF(Fixtures!$K$23=\"\",\"\",Fixtures!$K$23)","v":""},{"$f":"IF(Fixtures!$L$23=\"\",\"\",Fixtures!$L$23)","v":""},"",{"$f":"IF(Fixtures!$K$225=\"\",\"\",Fixtures!$K$225)","v":""},{"$f":"IF(Fixtures!$L$225=\"\",\"\",Fixtures!$L$225)","v":""},"",null,null,"",{"$f":"IF(Fixtures!$K$182=\"\",\"\",Fixtures!$K$182)","v":""},{"$f":"IF(Fixtures!$L$182=\"\",\"\",Fixtures!$L$182)","v":""},"","Western United FC",{"$f":"SUM(AS14:AU14)","v":0},0,0,0,0,0,0,0,null,{"$f":"SUM(BB14:BD14)","v":1},{"$f":"AK16","v":0},{"$f":"AL16","v":1},0,{"$f":"AL17","v":1},{"$f":"AM17","v":1},{"$f":"BE14-BF14","v":0},{"$f":"BB14*3+BC14","v":1},null,1,0,1,{"$f":"AU14+BD14","v":0},1,1,0,1]
[null,{"$f":"Fixtures!P8","v":"GLO"},{"$f":"Fixtures!J8","v":"Perth Glory"},{"$f":"IF(Fixtures!$K$129=\"\",\"\",Fixtures!$K$129)","v":""},{"$f":"IF(Fixtures!$L$129=\"\",\"\",Fixtures!$L$129)","v":""},"",{"$f":"IF(Fixtures!$K$95=\"\",\"\",Fixtures!$K$95)","v":""},{"$f":"IF(Fixtures!$L$95=\"\",\"\",Fixtures!$L$95)","v":""},"",{"$f":"IF(Fixtures!$K$58=\"\",\"\",Fixtures!$K$58)","v":""},{"$f":"IF(Fixtures!$L$58=\"\",\"\",Fixtures!$L$58)","v":""},"",{"$f":"IF(Fixtures!$K$98=\"\",\"\",Fixtures!$K$98)","v":""},{"$f":"IF(Fixtures!$L$98=\"\",\"\",Fixtures!$L$98)","v":""},"",{"$f":"IF(Fixtures!$K$13=\"\",\"\",Fixtures!$K$13)","v":""},{"$f":"IF(Fixtures!$L$13=\"\",\"\",Fixtures!$L$13)","v":""},"",{"$f":"IF(Fixtures!$K$69=\"\",\"\",Fixtures!$K$69)","v":""},{"$f":"IF(Fixtures!$L$69=\"\",\"\",Fixtures!$L$69)","v":""},"",{"$f":"IF(Fixtures!$K$190=\"\",\"\",Fixtures!$K$190)","v":""},{"$f":"IF(Fixtures!$L$190=\"\",\"\",Fixtures!$L$190)","v":""},"",{"$f":"IF(Fixtures!$K$125=\"\",\"\",Fixtures!$K$125)","v":""},{"$f":"IF(Fixtures!$L$125=\"\",\"\",Fixtures!$L$125)","v":""},"",{"$f":"IF(Fixtures!$K$168=\"\",\"\",Fixtures!$K$168)","v":""},{"$f":"IF(Fixtures!$L$168=\"\",\"\",Fixtures!$L$168)","v":""},"",{"$f":"IF(Fixtures!$K$30=\"\",\"\",Fixtures!$K$30)","v":""},{"$f":"IF(Fixtures!$L$30=\"\",\"\",Fixtures!$L$30)","v":""},"",{"$f":"IF(Fixtures!$K$147=\"\",\"\",Fixtures!$K$147)","v":""},{"$f":"IF(Fixtures!$L$147=\"\",\"\",Fixtures!$L$147)","v":""},"",{"$f":"IF(Fixtures!$K$86=\"\",\"\",Fixtures!$K$86)","v":""},{"$f":"IF(Fixtures!$L$86=\"\",\"\",Fixtures!$L$86)","v":""},"",null,null,"","Perth Glory",{"$f":"SUM(AS15:AU15)","v":0},0,0,0,0,0,0,0,null,1,{"$f":"AN16","v":0},{"$f":"AO16","v":0},1,{"$f":"AO17","v":1},{"$f":"AP17","v":6},-5,0,null,1,{"$f":"AS15+BB15","v":0},0,{"$f":"AU15+BD15","v":1},1,6,{"$f":"AX15+BG15","v":-5},0]
[null,"W/D/L",null,{"$f":"IF(F3=\"L\",1,0)+IF(F4=\"L\",1,0)+IF(F5=\"L\",1,0)+IF(F6=\"L\",1,0)+IF(F7=\"L\",1,0)+IF(F8=\"L\",1,0)+IF(F9=\"L\",1,0)+IF(F10=\"L\",1,0)+IF(F11=\"L\",1,0)+IF(F12=\"L\",1,0)+IF(F13=\"L\",1,0)+IF(F14=\"L\",1,0)+IF(F15=\"L\",1,0)","v":0},{"$f":"IF(F3=\"D\",1,0)+IF(F4=\"D\",1,0)+IF(F5=\"D\",1,0)+IF(F6=\"D\",1,0)+IF(F7=\"D\",1,0)+IF(F8=\"D\",1,0)+IF(F9=\"D\",1,0)+IF(F10=\"D\",1,0)+IF(F11=\"D\",1,0)+IF(F12=\"D\",1,0)+IF(F13=\"D\",1,0)+IF(F14=\"D\",1,0)+IF(F15=\"D\",1,0)","v":0},{"$f":"IF(F3=\"W\",1,0)+IF(F4=\"W\",1,0)+IF(F5=\"W\",1,0)+IF(F6=\"W\",1,0)+IF(F7=\"W\",1,0)+IF(F8=\"W\",1,0)+IF(F9=\"W\",1,0)+IF(F10=\"W\",1,0)+IF(F11=\"W\",1,0)+IF(F12=\"W\",1,0)+IF(F13=\"W\",1,0)+IF(F14=\"W\",1,0)+IF(F15=\"W\",1,0)","v":0},{"$f":"IF(I3=\"L\",1,0)+IF(I4=\"L\",1,0)+IF(I5=\"L\",1,0)+IF(I6=\"L\",1,0)+IF(I7=\"L\",1,0)+IF(I8=\"L\",1,0)+IF(I9=\"L\",1,0)+IF(I10=\"L\",1,0)+IF(I11=\"L\",1,0)+IF(I12=\"L\",1,0)+IF(I13=\"L\",1,0)+IF(I14=\"L\",1,0)+IF(I15=\"L\",1,0)","v":0},{"$f":"IF(I3=\"D\",1,0)+IF(I4=\"D\",1,0)+IF(I5=\"D\",1,0)+IF(I6=\"D\",1,0)+IF(I7=\"D\",1,0)+IF(I8=\"D\",1,0)+IF(I9=\"D\",1,0)+IF(I10=\"D\",1,0)+IF(I11=\"D\",1,0)+IF(I12=\"D\",1,0)+IF(I13=\"D\",1,0)+IF(I14=\"D\",1,0)+IF(I15=\"D\",1,0)","v":0},{"$f":"IF(I3=\"W\",1,0)+IF(I4=\"W\",1,0)+IF(I5=\"W\",1,0)+IF(I6=\"W\",1,0)+IF(I7=\"W\",1,0)+IF(I8=\"W\",1,0)+IF(I9=\"W\",1,0)+IF(I10=\"W\",1,0)+IF(I11=\"W\",1,0)+IF(I12=\"W\",1,0)+IF(I13=\"W\",1,0)+IF(I14=\"W\",1,0)+IF(I15=\"W\",1,0)","v":0},{"$f":"IF(L3=\"L\",1,0)+IF(L4=\"L\",1,0)+IF(L5=\"L\",1,0)+IF(L6=\"L\",1,0)+IF(L7=\"L\",1,0)+IF(L8=\"L\",1,0)+IF(L9=\"L\",1,0)+IF(L10=\"L\",1,0)+IF(L11=\"L\",1,0)+IF(L12=\"L\",1,0)+IF(L13=\"L\",1,0)+IF(L14=\"L\",1,0)+IF(L15=\"L\",1,0)","v":0},{"$f":"IF(L3=\"D\",1,0)+IF(L4=\"D\",1,0)+IF(L5=\"D\",1,0)+IF(L6=\"D\",1,0)+IF(L7=\"D\",1,0)+IF(L8=\"D\",1,0)+IF(L9=\"D\",1,0)+IF(L10=\"D\",1,0)+IF(L11=\"D\",1,0)+IF(L12=\"D\",1,0)+IF(L13=\"D\",1,0)+IF(L14=\"D\",1,0)+IF(L15=\"D\",1,0)","v":0},{"$f":"IF(L3=\"W\",1,0)+IF(L4=\"W\",1,0)+IF(L5=\"W\",1,0)+IF(L6=\"W\",1,0)+IF(L7=\"W\",1,0)+IF(L8=\"W\",1,0)+IF(L9=\"W\",1,0)+IF(L10=\"W\",1,0)+IF(L11=\"W\",1,0)+IF(L12=\"W\",1,0)+IF(L13=\"W\",1,0)+IF(L14=\"W\",1,0)+IF(L15=\"W\",1,0)","v":0},{"$f":"IF(O3=\"L\",1,0)+IF(O4=\"L\",1,0)+IF(O5=\"L\",1,0)+IF(O6=\"L\",1,0)+IF(O7=\"L\",1,0)+IF(O8=\"L\",1,0)+IF(O9=\"L\",1,0)+IF(O10=\"L\",1,0)+IF(O11=\"L\",1,0)+IF(O12=\"L\",1,0)+IF(O13=\"L\",1,0)+IF(O14=\"L\",1,0)+IF(O15=\"L\",1,0)","v":0},{"$f":"IF(O3=\"D\",1,0)+IF(O4=\"D\",1,0)+IF(O5=\"D\",1,0)+IF(O6=\"D\",1,0)+IF(O7=\"D\",1,0)+IF(O8=\"D\",1,0)+IF(O9=\"D\",1,0)+IF(O10=\"D\",1,0)+IF(O11=\"D\",1,0)+IF(O12=\"D\",1,0)+IF(O13=\"D\",1,0)+IF(O14=\"D\",1,0)+IF(O15=\"D\",1,0)","v":0},{"$f":"IF(O3=\"W\",1,0)+IF(O4=\"W\",1,0)+IF(O5=\"W\",1,0)+IF(O6=\"W\",1,0)+IF(O7=\"W\",1,0)+IF(O8=\"W\",1,0)+IF(O9=\"W\",1,0)+IF(O10=\"W\",1,0)+IF(O11=\"W\",1,0)+IF(O12=\"W\",1,0)+IF(O13=\"W\",1,0)+IF(O14=\"W\",1,0)+IF(O15=\"W\",1,0)","v":0},{"$f":"IF(R3=\"L\",1,0)+IF(R4=\"L\",1,0)+IF(R5=\"L\",1,0)+IF(R6=\"L\",1,0)+IF(R7=\"L\",1,0)+IF(R8=\"L\",1,0)+IF(R9=\"L\",1,0)+IF(R10=\"L\",1,0)+IF(R11=\"L\",1,0)+IF(R12=\"L\",1,0)+IF(R13=\"L\",1,0)+IF(R14=\"L\",1,0)+IF(R15=\"L\",1,0)","v":0},{"$f":"IF(R3=\"D\",1,0)+IF(R4=\"D\",1,0)+IF(R5=\"D\",1,0)+IF(R6=\"D\",1,0)+IF(R7=\"D\",1,0)+IF(R8=\"D\",1,0)+IF(R9=\"D\",1,0)+IF(R10=\"D\",1,0)+IF(R11=\"D\",1,0)+IF(R12=\"D\",1,0)+IF(R13=\"D\",1,0)+IF(R14=\"D\",1,0)+IF(R15=\"D\",1,0)","v":0},{"$f":"IF(R3=\"W\",1,0)+IF(R4=\"W\",1,0)+IF(R5=\"W\",1,0)+IF(R6=\"W\",1,0)+IF(R7=\"W\",1,0)+IF(R8=\"W\",1,0)+IF(R9=\"W\",1,0)+IF(R10=\"W\",1,0)+IF(R11=\"W\",1,0)+IF(R12=\"W\",1,0)+IF(R13=\"W\",1,0)+IF(R14=\"W\",1,0)+IF(R15=\"W\",1,0)","v":0},{"$f":"IF(U3=\"L\",1,0)+IF(U4=\"L\",1,0)+IF(U5=\"L\",1,0)+IF(U6=\"L\",1,0)+IF(U7=\"L\",1,0)+IF(U8=\"L\",1,0)+IF(U9=\"L\",1,0)+IF(U10=\"L\",1,0)+IF(U11=\"L\",1,0)+IF(U12=\"L\",1,0)+IF(U13=\"L\",1,0)+IF(U14=\"L\",1,0)+IF(U15=\"L\",1,0)","v":0},{"$f":"IF(U3=\"D\",1,0)+IF(U4=\"D\",1,0)+IF(U5=\"D\",1,0)+IF(U6=\"D\",1,0)+IF(U7=\"D\",1,0)+IF(U8=\"D\",1,0)+IF(U9=\"D\",1,0)+IF(U10=\"D\",1,0)+IF(U11=\"D\",1,0)+IF(U12=\"D\",1,0)+IF(U13=\"D\",1,0)+IF(U14=\"D\",1,0)+IF(U15=\"D\",1,0)","v":0},{"$f":"IF(U3=\"W\",1,0)+IF(U4=\"W\",1,0)+IF(U5=\"W\",1,0)+IF(U6=\"W\",1,0)+IF(U7=\"W\",1,0)+IF(U8=\"W\",1,0)+IF(U9=\"W\",1,0)+IF(U10=\"W\",1,0)+IF(U11=\"W\",1,0)+IF(U12=\"W\",1,0)+IF(U13=\"W\",1,0)+IF(U14=\"W\",1,0)+IF(U15=\"W\",1,0)","v":0},{"$f":"IF(X3=\"L\",1,0)+IF(X4=\"L\",1,0)+IF(X5=\"L\",1,0)+IF(X6=\"L\",1,0)+IF(X7=\"L\",1,0)+IF(X8=\"L\",1,0)+IF(X9=\"L\",1,0)+IF(X10=\"L\",1,0)+IF(X11=\"L\",1,0)+IF(X12=\"L\",1,0)+IF(X13=\"L\",1,0)+IF(X14=\"L\",1,0)+IF(X15=\"L\",1,0)","v":0},{"$f":"IF(X3=\"D\",1,0)+IF(X4=\"D\",1,0)+IF(X5=\"D\",1,0)+IF(X6=\"D\",1,0)+IF(X7=\"D\",1,0)+IF(X8=\"D\",1,0)+IF(X9=\"D\",1,0)+IF(X10=\"D\",1,0)+IF(X11=\"D\",1,0)+IF(X12=\"D\",1,0)+IF(X13=\"D\",1,0)+IF(X14=\"D\",1,0)+IF(X15=\"D\",1,0)","v":0},{"$f":"IF(X3=\"W\",1,0)+IF(X4=\"W\",1,0)+IF(X5=\"W\",1,0)+IF(X6=\"W\",1,0)+IF(X7=\"W\",1,0)+IF(X8=\"W\",1,0)+IF(X9=\"W\",1,0)+IF(X10=\"W\",1,0)+IF(X11=\"W\",1,0)+IF(X12=\"W\",1,0)+IF(X13=\"W\",1,0)+IF(X14=\"W\",1,0)+IF(X15=\"W\",1,0)","v":0},{"$f":"IF(AA3=\"L\",1,0)+IF(AA4=\"L\",1,0)+IF(AA5=\"L\",1,0)+IF(AA6=\"L\",1,0)+IF(AA7=\"L\",1,0)+IF(AA8=\"L\",1,0)+IF(AA9=\"L\",1,0)+IF(AA10=\"L\",1,0)+IF(AA11=\"L\",1,0)+IF(AA12=\"L\",1,0)+IF(AA13=\"L\",1,0)+IF(AA14=\"L\",1,0)+IF(AA15=\"L\",1,0)","v":0},{"$f":"IF(AA3=\"D\",1,0)+IF(AA4=\"D\",1,0)+IF(AA5=\"D\",1,0)+IF(AA6=\"D\",1,0)+IF(AA7=\"D\",1,0)+IF(AA8=\"D\",1,0)+IF(AA9=\"D\",1,0)+IF(AA10=\"D\",1,0)+IF(AA11=\"D\",1,0)+IF(AA12=\"D\",1,0)+IF(AA13=\"D\",1,0)+IF(AA14=\"D\",1,0)+IF(AA15=\"D\",1,0)","v":1},{"$f":"IF(AA3=\"W\",1,0)+IF(AA4=\"W\",1,0)+IF(AA5=\"W\",1,0)+IF(AA6=\"W\",1,0)+IF(AA7=\"W\",1,0)+IF(AA8=\"W\",1,0)+IF(AA9=\"W\",1,0)+IF(AA10=\"W\",1,0)+IF(AA11=\"W\",1,0)+IF(AA12=\"W\",1,0)+IF(AA13=\"W\",1,0)+IF(AA14=\"W\",1,0)+IF(AA15=\"W\",1,0)","v":0},{"$f":"IF(AD3=\"L\",1,0)+IF(AD4=\"L\",1,0)+IF(AD5=\"L\",1,0)+IF(AD6=\"L\",1,0)+IF(AD7=\"L\",1,0)+IF(AD8=\"L\",1,0)+IF(AD9=\"L\",1,0)+IF(AD10=\"L\",1,0)+IF(AD11=\"L\",1,0)+IF(AD12=\"L\",1,0)+IF(AD13=\"L\",1,0)+IF(AD14=\"L\",1,0)+IF(AD15=\"L\",1,0)","v":0},{"$f":"IF(AD3=\"D\",1,0)+IF(AD4=\"D\",1,0)+IF(AD5=\"D\",1,0)+IF(AD6=\"D\",1,0)+IF(AD7=\"D\",1,0)+IF(AD8=\"D\",1,0)+IF(AD9=\"D\",1,0)+IF(AD10=\"D\",1,0)+IF(AD11=\"D\",1,0)+IF(AD12=\"D\",1,0)+IF(AD13=\"D\",1,0)+IF(AD14=\"D\",1,0)+IF(AD15=\"D\",1,0)","v":0},{"$f":"IF(AD3=\"W\",1,0)+IF(AD4=\"W\",1,0)+IF(AD5=\"W\",1,0)+IF(AD6=\"W\",1,0)+IF(AD7=\"W\",1,0)+IF(AD8=\"W\",1,0)+IF(AD9=\"W\",1,0)+IF(AD10=\"W\",1,0)+IF(AD11=\"W\",1,0)+IF(AD12=\"W\",1,0)+IF(AD13=\"W\",1,0)+IF(AD14=\"W\",1,0)+IF(AD15=\"W\",1,0)","v":1},{"$f":"IF(AG3=\"L\",1,0)+IF(AG4=\"L\",1,0)+IF(AG5=\"L\",1,0)+IF(AG6=\"L\",1,0)+IF(AG7=\"L\",1,0)+IF(AG8=\"L\",1,0)+IF(AG9=\"L\",1,0)+IF(AG10=\"L\",1,0)+IF(AG11=\"L\",1,0)+IF(AG12=\"L\",1,0)+IF(AG13=\"L\",1,0)+IF(AG14=\"L\",1,0)+IF(AG15=\"L\",1,0)","v":1},{"$f":"IF(AG3=\"D\",1,0)+IF(AG4=\"D\",1,0)+IF(AG5=\"D\",1,0)+IF(AG6=\"D\",1,0)+IF(AG7=\"D\",1,0)+IF(AG8=\"D\",1,0)+IF(AG9=\"D\",1,0)+IF(AG10=\"D\",1,0)+IF(AG11=\"D\",1,0)+IF(AG12=\"D\",1,0)+IF(AG13=\"D\",1,0)+IF(AG14=\"D\",1,0)+IF(AG15=\"D\",1,0)","v":0},{"$f":"IF(AG3=\"W\",1,0)+IF(AG4=\"W\",1,0)+IF(AG5=\"W\",1,0)+IF(AG6=\"W\",1,0)+IF(AG7=\"W\",1,0)+IF(AG8=\"W\",1,0)+IF(AG9=\"W\",1,0)+IF(AG10=\"W\",1,0)+IF(AG11=\"W\",1,0)+IF(AG12=\"W\",1,0)+IF(AG13=\"W\",1,0)+IF(AG14=\"W\",1,0)+IF(AG15=\"W\",1,0)","v":0},{"$f":"IF(AJ3=\"L\",1,0)+IF(AJ4=\"L\",1,0)+IF(AJ5=\"L\",1,0)+IF(AJ6=\"L\",1,0)+IF(AJ7=\"L\",1,0)+IF(AJ8=\"L\",1,0)+IF(AJ9=\"L\",1,0)+IF(AJ10=\"L\",1,0)+IF(AJ11=\"L\",1,0)+IF(AJ12=\"L\",1,0)+IF(AJ13=\"L\",1,0)+IF(AJ14=\"L\",1,0)+IF(AJ15=\"L\",1,0)","v":1},{"$f":"IF(AJ3=\"D\",1,0)+IF(AJ4=\"D\",1,0)+IF(AJ5=\"D\",1,0)+IF(AJ6=\"D\",1,0)+IF(AJ7=\"D\",1,0)+IF(AJ8=\"D\",1,0)+IF(AJ9=\"D\",1,0)+IF(AJ10=\"D\",1,0)+IF(AJ11=\"D\",1,0)+IF(AJ12=\"D\",1,0)+IF(AJ13=\"D\",1,0)+IF(AJ14=\"D\",1,0)+IF(AJ15=\"D\",1,0)","v":0},{"$f":"IF(AJ3=\"W\",1,0)+IF(AJ4=\"W\",1,0)+IF(AJ5=\"W\",1,0)+IF(AJ6=\"W\",1,0)+IF(AJ7=\"W\",1,0)+IF(AJ8=\"W\",1,0)+IF(AJ9=\"W\",1,0)+IF(AJ10=\"W\",1,0)+IF(AJ11=\"W\",1,0)+IF(AJ12=\"W\",1,0)+IF(AJ13=\"W\",1,0)+IF(AJ14=\"W\",1,0)+IF(AJ15=\"W\",1,0)","v":0},{"$f":"IF(AM3=\"L\",1,0)+IF(AM4=\"L\",1,0)+IF(AM5=\"L\",1,0)+IF(AM6=\"L\",1,0)+IF(AM7=\"L\",1,0)+IF(AM8=\"L\",1,0)+IF(AM9=\"L\",1,0)+IF(AM10=\"L\",1,0)+IF(AM11=\"L\",1,0)+IF(AM12=\"L\",1,0)+IF(AM13=\"L\",1,0)+IF(AM14=\"L\",1,0)+IF(AM15=\"L\",1,0)","v":0},{"$f":"IF(AM3=\"D\",1,0)+IF(AM4=\"D\",1,0)+IF(AM5=\"D\",1,0)+IF(AM6=\"D\",1,0)+IF(AM7=\"D\",1,0)+IF(AM8=\"D\",1,0)+IF(AM9=\"D\",1,0)+IF(AM10=\"D\",1,0)+IF(AM11=\"D\",1,0)+IF(AM12=\"D\",1,0)+IF(AM13=\"D\",1,0)+IF(AM14=\"D\",1,0)+IF(AM15=\"D\",1,0)","v":1},{"$f":"IF(AM3=\"W\",1,0)+IF(AM4=\"W\",1,0)+IF(AM5=\"W\",1,0)+IF(AM6=\"W\",1,0)+IF(AM7=\"W\",1,0)+IF(AM8=\"W\",1,0)+IF(AM9=\"W\",1,0)+IF(AM10=\"W\",1,0)+IF(AM11=\"W\",1,0)+IF(AM12=\"W\",1,0)+IF(AM13=\"W\",1,0)+IF(AM14=\"W\",1,0)+IF(AM15=\"W\",1,0)","v":0},{"$f":"IF(AP3=\"L\",1,0)+IF(AP4=\"L\",1,0)+IF(AP5=\"L\",1,0)+IF(AP6=\"L\",1,0)+IF(AP7=\"L\",1,0)+IF(AP8=\"L\",1,0)+IF(AP9=\"L\",1,0)+IF(AP10=\"L\",1,0)+IF(AP11=\"L\",1,0)+IF(AP12=\"L\",1,0)+IF(AP13=\"L\",1,0)+IF(AP14=\"L\",1,0)+IF(AP15=\"L\",1,0)","v":0},{"$f":"IF(AP3=\"D\",1,0)+IF(AP4=\"D\",1,0)+IF(AP5=\"D\",1,0)+IF(AP6=\"D\",1,0)+IF(AP7=\"D\",1,0)+IF(AP8=\"D\",1,0)+IF(AP9=\"D\",1,0)+IF(AP10=\"D\",1,0)+IF(AP11=\"D\",1,0)+IF(AP12=\"D\",1,0)+IF(AP13=\"D\",1,0)+IF(AP14=\"D\",1,0)+IF(AP15=\"D\",1,0)","v":0},{"$f":"IF(AP3=\"W\",1,0)+IF(AP4=\"W\",1,0)+IF(AP5=\"W\",1,0)+IF(AP6=\"W\",1,0)+IF(AP7=\"W\",1,0)+IF(AP8=\"W\",1,0)+IF(AP9=\"W\",1,0)+IF(AP10=\"W\",1,0)+IF(AP11=\"W\",1,0)+IF(AP12=\"W\",1,0)+IF(AP13=\"W\",1,0)+IF(AP14=\"W\",1,0)+IF(AP15=\"W\",1,0)","v":1}]
[null,"F/A",null,null,{"$f":"SUM(E3)+SUM(E4)+SUM(E5)+SUM(E6)+SUM(E7)+SUM(E8)+SUM(E9)+SUM(E10)+SUM(E11)+SUM(E12)+SUM(E13)+SUM(E14)+SUM(E15)","v":0},{"$f":"SUM(D3)+SUM(D4)+SUM(D5)+SUM(D6)+SUM(D7)+SUM(D8)+SUM(D9)+SUM(D10)+SUM(D11)+SUM(D12)+SUM(D13)+SUM(D14)+SUM(D15)","v":0},null,{"$f":"SUM(H3)+SUM(H4)+SUM(H5)+SUM(H6)+SUM(H7)+SUM(H8)+SUM(H9)+SUM(H10)+SUM(H11)+SUM(H12)+SUM(H13)+SUM(H14)+SUM(H15)","v":0},{"$f":"SUM(G3)+SUM(G4)+SUM(G5)+SUM(G6)+SUM(G7)+SUM(G8)+SUM(G9)+SUM(G10)+SUM(G11)+SUM(G12)+SUM(G13)+SUM(G14)+SUM(G15)","v":0},null,{"$f":"SUM(K3)+SUM(K4)+SUM(K5)+SUM(K6)+SUM(K7)+SUM(K8)+SUM(K9)+SUM(K10)+SUM(K11)+SUM(K12)+SUM(K13)+SUM(K14)+SUM(K15)","v":0},{"$f":"SUM(J3)+SUM(J4)+SUM(J5)+SUM(J6)+SUM(J7)+SUM(J8)+SUM(J9)+SUM(J10)+SUM(J11)+SUM(J12)+SUM(J13)+SUM(J14)+SUM(J15)","v":0},null,{"$f":"SUM(N3)+SUM(N4)+SUM(N5)+SUM(N6)+SUM(N7)+SUM(N8)+SUM(N9)+SUM(N10)+SUM(N11)+SUM(N12)+SUM(N13)+SUM(N14)+SUM(N15)","v":0},{"$f":"SUM(M3)+SUM(M4)+SUM(M5)+SUM(M6)+SUM(M7)+SUM(M8)+SUM(M9)+SUM(M10)+SUM(M11)+SUM(M12)+SUM(M13)+SUM(M14)+SUM(M15)","v":0},null,{"$f":"SUM(Q3)+SUM(Q4)+SUM(Q5)+SUM(Q6)+SUM(Q7)+SUM(Q8)+SUM(Q9)+SUM(Q10)+SUM(Q11)+SUM(Q12)+SUM(Q13)+SUM(Q14)+SUM(Q15)","v":0},{"$f":"SUM(P3)+SUM(P4)+SUM(P5)+SUM(P6)+SUM(P7)+SUM(P8)+SUM(P9)+SUM(P10)+SUM(P11)+SUM(P12)+SUM(P13)+SUM(P14)+SUM(P15)","v":0},null,{"$f":"SUM(T3)+SUM(T4)+SUM(T5)+SUM(T6)+SUM(T7)+SUM(T8)+SUM(T9)+SUM(T10)+SUM(T11)+SUM(T12)+SUM(T13)+SUM(T14)+SUM(T15)","v":0},{"$f":"SUM(S3)+SUM(S4)+SUM(S5)+SUM(S6)+SUM(S7)+SUM(S8)+SUM(S9)+SUM(S10)+SUM(S11)+SUM(S12)+SUM(S13)+SUM(S14)+SUM(S15)","v":0},null,{"$f":"SUM(W3)+SUM(W4)+SUM(W5)+SUM(W6)+SUM(W7)+SUM(W8)+SUM(W9)+SUM(W10)+SUM(W11)+SUM(W12)+SUM(W13)+SUM(W14)+SUM(W15)","v":0},{"$f":"SUM(V3)+SUM(V4)+SUM(V5)+SUM(V6)+SUM(V7)+SUM(V8)+SUM(V9)+SUM(V10)+SUM(V11)+SUM(V12)+SUM(V13)+SUM(V14)+SUM(V15)","v":0},null,{"$f":"SUM(Z3)+SUM(Z4)+SUM(Z5)+SUM(Z6)+SUM(Z7)+SUM(Z8)+SUM(Z9)+SUM(Z10)+SUM(Z11)+SUM(Z12)+SUM(Z13)+SUM(Z14)+SUM(Z15)","v":0},{"$f":"SUM(Y3)+SUM(Y4)+SUM(Y5)+SUM(Y6)+SUM(Y7)+SUM(Y8)+SUM(Y9)+SUM(Y10)+SUM(Y11)+SUM(Y12)+SUM(Y13)+SUM(Y14)+SUM(Y15)","v":0},null,{"$f":"SUM(AC3)+SUM(AC4)+SUM(AC5)+SUM(AC6)+SUM(AC7)+SUM(AC8)+SUM(AC9)+SUM(AC10)+SUM(AC11)+SUM(AC12)+SUM(AC13)+SUM(AC14)+SUM(AC15)","v":0},{"$f":"SUM(AB3)+SUM(AB4)+SUM(AB5)+SUM(AB6)+SUM(AB7)+SUM(AB8)+SUM(AB9)+SUM(AB10)+SUM(AB11)+SUM(AB12)+SUM(AB13)+SUM(AB14)+SUM(AB15)","v":2},null,{"$f":"SUM(AF3)+SUM(AF4)+SUM(AF5)+SUM(AF6)+SUM(AF7)+SUM(AF8)+SUM(AF9)+SUM(AF10)+SUM(AF11)+SUM(AF12)+SUM(AF13)+SUM(AF14)+SUM(AF15)","v":1},{"$f":"SUM(AE3)+SUM(AE4)+SUM(AE5)+SUM(AE6)+SUM(AE7)+SUM(AE8)+SUM(AE9)+SUM(AE10)+SUM(AE11)+SUM(AE12)+SUM(AE13)+SUM(AE14)+SUM(AE15)","v":0},null,{"$f":"SUM(AI3)+SUM(AI4)+SUM(AI5)+SUM(AI6)+SUM(AI7)+SUM(AI8)+SUM(AI9)+SUM(AI10)+SUM(AI11)+SUM(AI12)+SUM(AI13)+SUM(AI14)+SUM(AI15)","v":2},{"$f":"SUM(AH3)+SUM(AH4)+SUM(AH5)+SUM(AH6)+SUM(AH7)+SUM(AH8)+SUM(AH9)+SUM(AH10)+SUM(AH11)+SUM(AH12)+SUM(AH13)+SUM(AH14)+SUM(AH15)","v":1},null,{"$f":"SUM(AL3)+SUM(AL4)+SUM(AL5)+SUM(AL6)+SUM(AL7)+SUM(AL8)+SUM(AL9)+SUM(AL10)+SUM(AL11)+SUM(AL12)+SUM(AL13)+SUM(AL14)+SUM(AL15)","v":1},{"$f":"SUM(AK3)+SUM(AK4)+SUM(AK5)+SUM(AK6)+SUM(AK7)+SUM(AK8)+SUM(AK9)+SUM(AK10)+SUM(AK11)+SUM(AK12)+SUM(AK13)+SUM(AK14)+SUM(AK15)","v":1},null,{"$f":"SUM(AO3)+SUM(AO4)+SUM(AO5)+SUM(AO6)+SUM(AO7)+SUM(AO8)+SUM(AO9)+SUM(AO10)+SUM(AO11)+SUM(AO12)+SUM(AO13)+SUM(AO14)+SUM(AO15)","v":1},{"$f":"SUM(AN3)+SUM(AN4)+SUM(AN5)+SUM(AN6)+SUM(AN7)+SUM(AN8)+SUM(AN9)+SUM(AN10)+SUM(AN11)+SUM(AN12)+SUM(AN13)+SUM(AN14)+SUM(AN15)","v":6},null,{"$f":"SUM(AR3:AR16)","v":6}]
[null,null,null,null,null,null,null,null,null,null,null,null,null,null,null,null,null,null,null,null,null,null,null,null,null,null,null,null,null,null,null,null,null,null,null,null,null,null,null,null,null,null,null,"P","W","D","L","F","A","GD","Pts",null,"P","W","D","L","F","A","GD","Pts",null,"P","W","D","L","F","A","GD","Pts"]
[null,{"$f":"B3","v":"CCM"},"Central Coast Mariners",null,null,{"$f":"IF(D19=\"\",\"\",IF(E19=\"\",\"\",IF(D19>E19,\"W\",IF(D19=E19,\"D\",IF(D19<E19,\"L\")))))","v":""},null,null,{"$f":"IF(G19=\"\",\"\",IF(H19=\"\",\"\",IF(G19>H19,\"W\",IF(G19=H19,\"D\",IF(G19<H19,\"L\")))))","v":""},null,null,{"$f":"IF(J19=\"\",\"\",IF(K19=\"\",\"\",IF(J19>K19,\"W\",IF(J19=K19,\"D\",IF(J19<K19,\"L\")))))","v":""},null,null,{"$f":"IF(M19=\"\",\"\",IF(N19=\"\",\"\",IF(M19>N19,\"W\",IF(M19=N19,\"D\",IF(M19<N19,\"L\")))))","v":""},null,null,{"$f":"IF(P19=\"\",\"\",IF(Q19=\"\",\"\",IF(P19>Q19,\"W\",IF(P19=Q19,\"D\",IF(P19<Q19,\"L\")))))","v":""},null,null,{"$f":"IF(S19=\"\",\"\",IF(T19=\"\",\"\",IF(S19>T19,\"W\",IF(S19=T19,\"D\",IF(S19<T19,\"L\")))))","v":""},null,null,{"$f":"IF(V19=\"\",\"\",IF(W19=\"\",\"\",IF(V19>W19,\"W\",IF(V19=W19,\"D\",IF(V19<W19,\"L\")))))","v":""},null,null,{"$f":"IF(Y19=\"\",\"\",IF(Z19=\"\",\"\",IF(Y19>Z19,\"W\",IF(Y19=Z19,\"D\",IF(Y19<Z19,\"L\")))))","v":""},null,null,{"$f":"IF(AB19=\"\",\"\",IF(AC19=\"\",\"\",IF(AB19>AC19,\"W\",IF(AB19=AC19,\"D\",IF(AB19<AC19,\"L\")))))","v":""},null,null,{"$f":"IF(AE19=\"\",\"\",IF(AF19=\"\",\"\",IF(AE19>AF19,\"W\",IF(AE19=AF19,\"D\",IF(AE19<AF19,\"L\")))))","v":""},null,null,{"$f":"IF(AH19=\"\",\"\",IF(AI19=\"\",\"\",IF(AH19>AI19,\"W\",IF(AH19=AI19,\"D\",IF(AH19<AI19,\"L\")))))","v":""},null,null,{"$f":"IF(AK19=\"\",\"\",IF(AL19=\"\",\"\",IF(AK19>AL19,\"W\",IF(AK19=AL19,\"D\",IF(AK19<AL19,\"L\")))))","v":""},{"$f":"IF(Fixtures!$K$176=\"\",\"\",Fixtures!$K$176)","v":""},{"$f":"IF(Fixtures!$L$176=\"\",\"\",Fixtures!$L$176)","v":""},{"$f":"IF(AN19=\"\",\"\",IF(AO19=\"\",\"\",IF(AN19>AO19,\"W\",IF(AN19=AO19,\"D\",IF(AN19<AO19,\"L\")))))","v":""},{"$f":"AQ3","v":"Central Coast Mariners"},{"$f":"SUM(AS19:AU19)","v":0},{"$f":"IF(F19=\"W\",1,0)+IF(I19=\"W\",1,0)+IF(L19=\"W\",1,0)+IF(O19=\"W\",1,0)+IF(R19=\"W\",1,0)+IF(U19=\"W\",1,0)+IF(X19=\"W\",1,0)+IF(AA19=\"W\",1,0)+IF(AD19=\"W\",1,0)+IF(AG19=\"W\",1,0)+IF(AJ19=\"W\",1,0)+IF(AM19=\"W\",1,0)+IF(AP19=\"W\",1,0)","v":0},{"$f":"IF(F19=\"D\",1,0)+IF(I19=\"D\",1,0)+IF(L19=\"D\",1,0)+IF(O19=\"D\",1,0)+IF(R19=\"D\",1,0)+IF(U19=\"D\",1,0)+IF(X19=\"D\",1,0)+IF(AA19=\"D\",1,0)+IF(AD19=\"D\",1,0)+IF(AG19=\"D\",1,0)+IF(AJ19=\"D\",1,0)+IF(AM19=\"D\",1,0)+IF(AP19=\"D\",1,0)","v":0},{"$f":"IF(F19=\"L\",1,0)+IF(I19=\"L\",1,0)+IF(L19=\"L\",1,0)+IF(O19=\"L\",1,0)+IF(R19=\"L\",1,0)+IF(U19=\"L\",1,0)+IF(X19=\"L\",1,0)+IF(AA19=\"L\",1,0)+IF(AD19=\"L\",1,0)+IF(AG19=\"L\",1,0)+IF(AJ19=\"L\",1,0)+IF(AM19=\"L\",1,0)+IF(AP19=\"L\",1,0)","v":0},{"$f":"SUM(D19)+SUM(G19)+SUM(J19)+SUM(M19)+SUM(P19)+SUM(S19)+SUM(V19)+SUM(Y19)+SUM(AB19)+SUM(AE19)+SUM(AH19)+SUM(AK19)+SUM(AN19)","v":0},{"$f":"SUM(E19)+SUM(H19)+SUM(K19)+SUM(N19)+SUM(Q19)+SUM(T19)+SUM(W19)+SUM(Z19)+SUM(AC19)+SUM(AF19)+SUM(AI19)+SUM(AL19)+SUM(AO19)","v":0},{"$f":"AV19-AW19","v":0},{"$f":"AS19*3+AT19","v":0},null,{"$f":"SUM(BB19:BD19)","v":0},{"$f":"D32","v":0},{"$f":"E32","v":0},{"$f":"F32","v":0},{"$f":"E33","v":0},{"$f":"F33","v":0},{"$f":"BE19-BF19","v":0},{"$f":"BB19*3+BC19","v":0},null,{"$f":"AR19+BA19","v":0},{"$f":"AS19+BB19","v":0},{"$f":"AT19+BC19","v":0},{"$f":"AU19+BD19","v":0},{"$f":"AV19+BE19","v":0},{"$f":"AW19+BF19","v":0},{"$f":"AX19+BG19","v":0},{"$f":"AY19+BH19","v":0}]
[null,"UCK","Auckland FC",null,null,"",null,null,"",null,null,"",null,null,"",{"$f":"IF(Fixtures!$K$48=\"\",\"\",Fixtures!$K$48)","v":""},{"$f":"IF(Fixtures!$L$48=\"\",\"\",Fixtures!$L$48)","v":""},"",null,null,"",null,null,{"$f":"IF(V20=\"\",\"\",IF(W20=\"\",\"\",IF(V20>W20,\"W\",IF(V20=W20,\"D\",IF(V20<W20,\"L\")))))","v":""},null,null,"",null,null,"",null,null,"",null,null,"",null,null,"",null,null,"",{"$f":"AQ4","v":"Auckland FC"},{"$f":"SUM(AS20:AU20)","v":0},{"$f":"IF(F20=\"W\",1,0)+IF(I20=\"W\",1,0)+IF(L20=\"W\",1,0)+IF(O20=\"W\",1,0)+IF(R20=\"W\",1,0)+IF(U20=\"W\",1,0)+IF(X20=\"W\",1,0)+IF(AA20=\"W\",1,0)+IF(AD20=\"W\",1,0)+IF(AG20=\"W\",1,0)+IF(AJ20=\"W\",1,0)+IF(AM20=\"W\",1,0)+IF(AP20=\"W\",1,0)","v":0},{"$f":"IF(F20=\"D\",1,0)+IF(I20=\"D\",1,0)+IF(L20=\"D\",1,0)+IF(O20=\"D\",1,0)+IF(R20=\"D\",1,0)+IF(U20=\"D\",1,0)+IF(X20=\"D\",1,0)+IF(AA20=\"D\",1,0)+IF(AD20=\"D\",1,0)+IF(AG20=\"D\",1,0)+IF(AJ20=\"D\",1,0)+IF(AM20=\"D\",1,0)+IF(AP20=\"D\",1,0)","v":0},{"$f":"IF(F20=\"L\",1,0)+IF(I20=\"L\",1,0)+IF(L20=\"L\",1,0)+IF(O20=\"L\",1,0)+IF(R20=\"L\",1,0)+IF(U20=\"L\",1,0)+IF(X20=\"L\",1,0)+IF(AA20=\"L\",1,0)+IF(AD20=\"L\",1,0)+IF(AG20=\"L\",1,0)+IF(AJ20=\"L\",1,0)+IF(AM20=\"L\",1,0)+IF(AP20=\"L\",1,0)","v":0},{"$f":"SUM(D20)+SUM(G20)+SUM(J20)+SUM(M20)+SUM(P20)+SUM(S20)+SUM(V20)+SUM(Y20)+SUM(AB20)+SUM(AE20)+SUM(AH20)+SUM(AK20)+SUM(AN20)","v":0},{"$f":"SUM(E20)+SUM(H20)+SUM(K20)+SUM(N20)+SUM(Q20)+SUM(T20)+SUM(W20)+SUM(Z20)+SUM(AC20)+SUM(AF20)+SUM(AI20)+SUM(AL20)+SUM(AO20)","v":0},{"$f":"AV20-AW20","v":0},{"$f":"AS20*3+AT20","v":0},null,{"$f":"SUM(BB20:BD20)","v":0},{"$f":"G32","v":0},{"$f":"H32","v":0},{"$f":"I32","v":0},{"$f":"H33","v":0},{"$f":"I33","v":0},{"$f":"BE20-BF20","v":0},{"$f":"BB20*3+BC20","v":0},null,{"$f":"AR20+BA20","v":0},{"$f":"AS20+BB20","v":0},0,0,0,0,{"$f":"AX20+BG20","v":0},0]
[null,"NEW","Newcastle Jets",{"$f":"IF(Fixtures!$K$189=\"\",\"\",Fixtures!$K$189)","v":""},{"$f":"IF(Fixtures!$L$189=\"\",\"\",Fixtures!$L$189)","v":""},"",null,null,"",null,null,"",null,null,"",null,null,"",null,null,"",null,null,"",null,null,"",null,null,"",null,null,"",null,null,"",null,null,"",null,null,"","Newcastle Jets",{"$f":"SUM(AS21:AU21)","v":0},0,0,0,0,0,0,0,null,0,{"$f":"J32","v":0},{"$f":"K32","v":0},{"$f":"L32","v":0},{"$f":"K33","v":0},{"$f":"L33","v":0},0,0,null,{"$f":"AR21+BA21","v":0},{"$f":"AS21+BB21","v":0},0,0,0,0,{"$f":"AX21+BG21","v":0},0]
[null,"WSW","Western Sydney Wanderers FC",null,null,"",null,null,"",null,null,"",null,null,"",null,null,"",{"$f":"IF(Fixtures!$K$78=\"\",\"\",Fixtures!$K$78)","v":""},{"$f":"IF(Fixtures!$L$78=\"\",\"\",Fixtures!$L$78)","v":""},"",null,null,"",null,null,"",null,null,"",null,null,"",null,null,"",null,null,"",null,null,"","Western Sydney Wanderers FC",0,0,0,0,0,0,0,0,null,0,{"$f":"M32","v":0},{"$f":"N32","v":0},{"$f":"O32","v":0},{"$f":"N33","v":0},{"$f":"O33","v":0},0,0,null,{"$f":"AR22+BA22","v":0},0,0,0,0,0,0,0]
[null,"PHX","Wellington Phoenix",null,null,"",null,null,"",null,null,"",null,null,"",null,null,"",null,null,"",null,null,"",{"$f":"IF(Fixtures!$K$36=\"\",\"\",Fixtures!$K$36)","v":""},{"$f":"IF(Fixtures!$L$36=\"\",\"\",Fixtures!$L$36)","v":""},"",null,null,"",null,null,"",null,null,"",null,null,"",null,null,"","Wellington Phoenix",{"$f":"SUM(AS23:AU23)","v":0},0,0,0,0,0,0,0,null,0,{"$f":"P32","v":0},{"$f":"Q32","v":0},{"$f":"R32","v":0},{"$f":"Q33","v":0},{"$f":"R33","v":0},0,0,null,0,0,0,0,0,0,0,0]
[null,"MAC","Macarthur FC",null,null,"",null,null,"",{"$f":"IF(Fixtures!$K$172=\"\",\"\",Fixtures!$K$172)","v":""},{"$f":"IF(Fixtures!$L$172=\"\",\"\",Fixtures!$L$172)","v":""},"",null,null,"",null,null,"",null,null,"",null,null,"",null,null,"",null,null,"",null,null,"",null,null,"",null,null,"",null,null,"","Macarthur FC",{"$f":"SUM(AS24:AU24)","v":0},0,0,0,0,0,0,0,null,0,{"$f":"S32","v":0},{"$f":"T32","v":0},{"$f":"U32","v":0},{"$f":"T33","v":0},{"$f":"U33","v":0},0,0,null,{"$f":"AR24+BA24","v":0},{"$f":"AS24+BB24","v":0},0,0,0,0,0,0]
[null,"ADU","Adelaide United",null,null,"",null,null,null,null,null,"",null,null,null,null,null,"",null,null,null,null,null,"",null,null,"",null,null,"",null,null,"",{"$f":"IF(Fixtures!$K$61=\"\",\"\",Fixtures!$K$61)","v":""},{"$f":"IF(Fixtures!$L$61=\"\",\"\",Fixtures!$L$61)","v":""},"",null,null,"",null,null,"","Adelaide United",{"$f":"SUM(AS25:AU25)","v":0},0,0,0,0,0,0,0,null,{"$f":"SUM(BB25:BD25)","v":0},{"$f":"V32","v":0},{"$f":"W32","v":0},{"$f":"X32","v":0},{"$f":"W33","v":0},{"$f":"X33","v":0},0,0,null,{"$f":"AR25+BA25","v":0},{"$f":"AS25+BB25","v":0},0,0,0,0,0,0]
[null,"VIC","Melbourne Victory",null,null,"",null,null,"",null,null,"",null,null,"",null,null,"",null,null,"",null,null,"",null,null,"",null,null,"",{"$f":"IF(Fixtures!$K$146=\"\",\"\",Fixtures!$K$146)","v":""},{"$f":"IF(Fixtures!$L$146=\"\",\"\",Fixtures!$L$146)","v":""},"",null,null,"",null,null,"",null,null,"","Melbourne Victory",{"$f":"SUM(AS26:AU26)","v":0},0,0,0,0,0,0,0,null,{"$f":"SUM(BB26:BD26)","v":0},{"$f":"Y32","v":0},{"$f":"Z32","v":0},{"$f":"AA32","v":0},{"$f":"Z33","v":0},{"$f":"AA33","v":0},0,0,null,0,{"$f":"AS26+BB26","v":0},{"$f":"AT26+BC26","v":0},{"$f":"AU26+BD26","v":0},{"$f":"AV26+BE26","v":0},{"$f":"AW26+BF26","v":0},{"$f":"AX26+BG26","v":0},{"$f":"AY26+BH26","v":0}]
[null,"BRI","Brisbane Roar FC",null,null,"",null,null,"",null,null,"",null,null,"",null,null,"",null,null,"",{"$f":"IF(Fixtures!$K$34=\"\",\"\",Fixtures!$K$34)","v":""},{"$f":"IF(Fixtures!$L$34=\"\",\"\",Fixtures!$L$34)","v":""},"",null,null,"",null,null,"",null,null,"",null,null,"",null,null,"",null,null,"","Brisbane Roar FC",0,0,0,0,0,0,0,0,null,0,{"$f":"AB32","v":0},{"$f":"AC32","v":0},{"$f":"AD32","v":0},{"$f":"AC33","v":0},{"$f":"AD33","v":0},0,0,null,0,0,0,0,0,0,0,0]
[null,"MCT","Melbourne City FC",null,null,"",null,null,"",null,null,"",null,null,"",null,null,"",null,null,"",null,null,"",null,null,"",{"$f":"IF(Fixtures!$K$93=\"\",\"\",Fixtures!$K$93)","v":""},{"$f":"IF(Fixtures!$L$93=\"\",\"\",Fixtures!$L$93)","v":""},"",null,null,"",null,null,"",null,null,"",null,null,"","Melbourne City FC",0,0,0,0,0,0,0,0,null,0,{"$f":"AE32","v":0},{"$f":"AF32","v":0},{"$f":"AG32","v":0},{"$f":"AF33","v":0},{"$f":"AG33","v":0},0,0,null,0,0,0,0,0,0,0,0]
[null,"SYD","Sydney FC",null,null,"",null,null,"",null,null,"",{"$f":"IF(Fixtures!$K$35=\"\",\"\",Fixtures!$K$35)","v":""},{"$f":"IF(Fixtures!$L$35=\"\",\"\",Fixtures!$L$35)","v":""},"",null,null,"",null,null,"",null,null,"",null,null,"",null,null,"",null,null,"",null,null,"",null,null,"",null,null,"","Sydney FC",{"$f":"SUM(AS29:AU29)","v":0},0,0,0,0,0,0,0,null,{"$f":"SUM(BB29:BD29)","v":0},{"$f":"AH32","v":0},{"$f":"AI32","v":0},{"$f":"AJ32","v":0},{"$f":"AI33","v":0},{"$f":"AJ33","v":0},{"$f":"BE29-BF29","v":0},{"$f":"BB29*3+BC29","v":0},null,{"$f":"AR29+BA29","v":0},0,0,0,0,0,0,0]
[null,"WUT","Western United FC",null,null,"",{"$f":"IF(Fixtures!$K$230=\"\",\"\",Fixtures!$K$230)","v":""},{"$f":"IF(Fixtures!$L$230=\"\",\"\",Fixtures!$L$230)","v":""},"",null,null,"",null,null,"",null,null,"",null,null,"",null,null,"",null,null,"",null,null,"",null,null,"",null,null,"",null,null,"",null,null,"","Western United FC",{"$f":"SUM(AS30:AU30)","v":0},0,0,0,0,0,0,0,null,{"$f":"SUM(BB30:BD30)","v":0},{"$f":"AK32","v":0},{"$f":"AL32","v":0},{"$f":"AM32","v":0},{"$f":"AL33","v":0},{"$f":"AM33","v":0},{"$f":"BE30-BF30","v":0},{"$f":"BB30*3+BC30","v":0},null,{"$f":"AR30+BA30","v":0},0,0,{"$f":"AU30+BD30","v":0},0,0,0,0]
[null,"GLO","Perth Glory",null,null,"",null,null,"",null,null,"",null,null,"",null,null,"",null,null,"",null,null,"",null,null,"",null,null,"",null,null,"",null,null,"",{"$f":"IF(Fixtures!$K$32=\"\",\"\",Fixtures!$K$32)","v":""},{"$f":"IF(Fixtures!$L$32=\"\",\"\",Fixtures!$L$32)","v":""},"",null,null,null,"Perth Glory",{"$f":"SUM(AS31:AU31)","v":0},0,0,0,0,0,0,0,null,{"$f":"SUM(BB31:BD31)","v":0},{"$f":"AN32","v":0},{"$f":"AO32","v":0},{"$f":"AP32","v":0},{"$f":"AO33","v":0},{"$f":"AP33","v":0},{"$f":"BE31-BF31","v":0},{"$f":"BB31*3+BC31","v":0},null,0,{"$f":"AS31+BB31","v":0},0,{"$f":"AU31+BD31","v":0},0,0,{"$f":"AX31+BG31","v":0},0]
[null,"W/D/L",null,{"$f":"IF(F19=\"L\",1,0)+IF(F20=\"L\",1,0)+IF(F21=\"L\",1,0)+IF(F22=\"L\",1,0)+IF(F23=\"L\",1,0)+IF(F24=\"L\",1,0)+IF(F25=\"L\",1,0)+IF(F26=\"L\",1,0)+IF(F27=\"L\",1,0)+IF(F28=\"L\",1,0)+IF(F29=\"L\",1,0)+IF(F30=\"L\",1,0)+IF(F31=\"L\",1,0)","v":0},{"$f":"IF(F19=\"D\",1,0)+IF(F20=\"D\",1,0)+IF(F21=\"D\",1,0)+IF(F22=\"D\",1,0)+IF(F23=\"D\",1,0)+IF(F24=\"D\",1,0)+IF(F25=\"D\",1,0)+IF(F26=\"D\",1,0)+IF(F27=\"D\",1,0)+IF(F28=\"D\",1,0)+IF(F29=\"D\",1,0)+IF(F30=\"D\",1,0)+IF(F31=\"D\",1,0)","v":0},{"$f":"IF(F19=\"W\",1,0)+IF(F20=\"W\",1,0)+IF(F21=\"W\",1,0)+IF(F22=\"W\",1,0)+IF(F23=\"W\",1,0)+IF(F24=\"W\",1,0)+IF(F25=\"W\",1,0)+IF(F26=\"W\",1,0)+IF(F27=\"W\",1,0)+IF(F28=\"W\",1,0)+IF(F29=\"W\",1,0)+IF(F30=\"W\",1,0)+IF(F31=\"W\",1,0)","v":0},{"$f":"IF(I19=\"L\",1,0)+IF(I20=\"L\",1,0)+IF(I21=\"L\",1,0)+IF(I22=\"L\",1,0)+IF(I23=\"L\",1,0)+IF(I24=\"L\",1,0)+IF(I25=\"L\",1,0)+IF(I26=\"L\",1,0)+IF(I27=\"L\",1,0)+IF(I28=\"L\",1,0)+IF(I29=\"L\",1,0)+IF(I30=\"L\",1,0)+IF(I31=\"L\",1,0)","v":0},{"$f":"IF(I19=\"D\",1,0)+IF(I20=\"D\",1,0)+IF(I21=\"D\",1,0)+IF(I22=\"D\",1,0)+IF(I23=\"D\",1,0)+IF(I24=\"D\",1,0)+IF(I25=\"D\",1,0)+IF(I26=\"D\",1,0)+IF(I27=\"D\",1,0)+IF(I28=\"D\",1,0)+IF(I29=\"D\",1,0)+IF(I30=\"D\",1,0)+IF(I31=\"D\",1,0)","v":0},{"$f":"IF(I19=\"W\",1,0)+IF(I20=\"W\",1,0)+IF(I21=\"W\",1,0)+IF(I22=\"W\",1,0)+IF(I23=\"W\",1,0)+IF(I24=\"W\",1,0)+IF(I25=\"W\",1,0)+IF(I26=\"W\",1,0)+IF(I27=\"W\",1,0)+IF(I28=\"W\",1,0)+IF(I29=\"W\",1,0)+IF(I30=\"W\",1,0)+IF(I31=\"W\",1,0)","v":0},{"$f":"IF(L19=\"L\",1,0)+IF(L20=\"L\",1,0)+IF(L21=\"L\",1,0)+IF(L22=\"L\",1,0)+IF(L23=\"L\",1,0)+IF(L24=\"L\",1,0)+IF(L25=\"L\",1,0)+IF(L26=\"L\",1,0)+IF(L27=\"L\",1,0)+IF(L28=\"L\",1,0)+IF(L29=\"L\",1,0)+IF(L30=\"L\",1,0)+IF(L31=\"L\",1,0)","v":0},{"$f":"IF(L19=\"D\",1,0)+IF(L20=\"D\",1,0)+IF(L21=\"D\",1,0)+IF(L22=\"D\",1,0)+IF(L23=\"D\",1,0)+IF(L24=\"D\",1,0)+IF(L25=\"D\",1,0)+IF(L26=\"D\",1,0)+IF(L27=\"D\",1,0)+IF(L28=\"D\",1,0)+IF(L29=\"D\",1,0)+IF(L30=\"D\",1,0)+IF(L31=\"D\",1,0)","v":0},{"$f":"IF(L19=\"W\",1,0)+IF(L20=\"W\",1,0)+IF(L21=\"W\",1,0)+IF(L22=\"W\",1,0)+IF(L23=\"W\",1,0)+IF(L24=\"W\",1,0)+IF(L25=\"W\",1,0)+IF(L26=\"W\",1,0)+IF(L27=\"W\",1,0)+IF(L28=\"W\",1,0)+IF(L29=\"W\",1,0)+IF(L30=\"W\",1,0)+IF(L31=\"W\",1,0)","v":0},{"$f":"IF(O19=\"L\",1,0)+IF(O20=\"L\",1,0)+IF(O21=\"L\",1,0)+IF(O22=\"L\",1,0)+IF(O23=\"L\",1,0)+IF(O24=\"L\",1,0)+IF(O25=\"L\",1,0)+IF(O26=\"L\",1,0)+IF(O27=\"L\",1,0)+IF(O28=\"L\",1,0)+IF(O29=\"L\",1,0)+IF(O30=\"L\",1,0)+IF(O31=\"L\",1,0)","v":0},{"$f":"IF(O19=\"D\",1,0)+IF(O20=\"D\",1,0)+IF(O21=\"D\",1,0)+IF(O22=\"D\",1,0)+IF(O23=\"D\",1,0)+IF(O24=\"D\",1,0)+IF(O25=\"D\",1,0)+IF(O26=\"D\",1,0)+IF(O27=\"D\",1,0)+IF(O28=\"D\",1,0)+IF(O29=\"D\",1,0)+IF(O30=\"D\",1,0)+IF(O31=\"D\",1,0)","v":0},{"$f":"IF(O19=\"W\",1,0)+IF(O20=\"W\",1,0)+IF(O21=\"W\",1,0)+IF(O22=\"W\",1,0)+IF(O23=\"W\",1,0)+IF(O24=\"W\",1,0)+IF(O25=\"W\",1,0)+IF(O26=\"W\",1,0)+IF(O27=\"W\",1,0)+IF(O28=\"W\",1,0)+IF(O29=\"W\",1,0)+IF(O30=\"W\",1,0)+IF(O31=\"W\",1,0)","v":0},{"$f":"IF(R19=\"L\",1,0)+IF(R20=\"L\",1,0)+IF(R21=\"L\",1,0)+IF(R22=\"L\",1,0)+IF(R23=\"L\",1,0)+IF(R24=\"L\",1,0)+IF(R25=\"L\",1,0)+IF(R26=\"L\",1,0)+IF(R27=\"L\",1,0)+IF(R28=\"L\",1,0)+IF(R29=\"L\",1,0)+IF(R30=\"L\",1,0)+IF(R31=\"L\",1,0)","v":0},{"$f":"IF(R19=\"D\",1,0)+IF(R20=\"D\",1,0)+IF(R21=\"D\",1,0)+IF(R22=\"D\",1,0)+IF(R23=\"D\",1,0)+IF(R24=\"D\",1,0)+IF(R25=\"D\",1,0)+IF(R26=\"D\",1,0)+IF(R27=\"D\",1,0)+IF(R28=\"D\",1,0)+IF(R29=\"D\",1,0)+IF(R30=\"D\",1,0)+IF(R31=\"D\",1,0)","v":0},{"$f":"IF(R19=\"W\",1,0)+IF(R20=\"W\",1,0)+IF(R21=\"W\",1,0)+IF(R22=\"W\",1,0)+IF(R23=\"W\",1,0)+IF(R24=\"W\",1,0)+IF(R25=\"W\",1,0)+IF(R26=\"W\",1,0)+IF(R27=\"W\",1,0)+IF(R28=\"W\",1,0)+IF(R29=\"W\",1,0)+IF(R30=\"W\",1,0)+IF(R31=\"W\",1,0)","v":0},{"$f":"IF(U19=\"L\",1,0)+IF(U20=\"L\",1,0)+IF(U21=\"L\",1,0)+IF(U22=\"L\",1,0)+IF(U23=\"L\",1,0)+IF(U24=\"L\",1,0)+IF(U25=\"L\",1,0)+IF(U26=\"L\",1,0)+IF(U27=\"L\",1,0)+IF(U28=\"L\",1,0)+IF(U29=\"L\",1,0)+IF(U30=\"L\",1,0)+IF(U31=\"L\",1,0)","v":0},{"$f":"IF(U19=\"D\",1,0)+IF(U20=\"D\",1,0)+IF(U21=\"D\",1,0)+IF(U22=\"D\",1,0)+IF(U23=\"D\",1,0)+IF(U24=\"D\",1,0)+IF(U25=\"D\",1,0)+IF(U26=\"D\",1,0)+IF(U27=\"D\",1,0)+IF(U28=\"D\",1,0)+IF(U29=\"D\",1,0)+IF(U30=\"D\",1,0)+IF(U31=\"D\",1,0)","v":0},{"$f":"IF(U19=\"W\",1,0)+IF(U20=\"W\",1,0)+IF(U21=\"W\",1,0)+IF(U22=\"W\",1,0)+IF(U23=\"W\",1,0)+IF(U24=\"W\",1,0)+IF(U25=\"W\",1,0)+IF(U26=\"W\",1,0)+IF(U27=\"W\",1,0)+IF(U28=\"W\",1,0)+IF(U29=\"W\",1,0)+IF(U30=\"W\",1,0)+IF(U31=\"W\",1,0)","v":0},{"$f":"IF(X19=\"L\",1,0)+IF(X20=\"L\",1,0)+IF(X21=\"L\",1,0)+IF(X22=\"L\",1,0)+IF(X23=\"L\",1,0)+IF(X24=\"L\",1,0)+IF(X25=\"L\",1,0)+IF(X26=\"L\",1,0)+IF(X27=\"L\",1,0)+IF(X28=\"L\",1,0)+IF(X29=\"L\",1,0)+IF(X30=\"L\",1,0)+IF(X31=\"L\",1,0)","v":0},{"$f":"IF(X19=\"D\",1,0)+IF(X20=\"D\",1,0)+IF(X21=\"D\",1,0)+IF(X22=\"D\",1,0)+IF(X23=\"D\",1,0)+IF(X24=\"D\",1,0)+IF(X25=\"D\",1,0)+IF(X26=\"D\",1,0)+IF(X27=\"D\",1,0)+IF(X28=\"D\",1,0)+IF(X29=\"D\",1,0)+IF(X30=\"D\",1,0)+IF(X31=\"D\",1,0)","v":0},{"$f":"IF(X19=\"W\",1,0)+IF(X20=\"W\",1,0)+IF(X21=\"W\",1,0)+IF(X22=\"W\",1,0)+IF(X23=\"W\",1,0)+IF(X24=\"W\",1,0)+IF(X25=\"W\",1,0)+IF(X26=\"W\",1,0)+IF(X27=\"W\",1,0)+IF(X28=\"W\",1,0)+IF(X29=\"W\",1,0)+IF(X30=\"W\",1,0)+IF(X31=\"W\",1,0)","v":0},{"$f":"IF(AA19=\"L\",1,0)+IF(AA20=\"L\",1,0)+IF(AA21=\"L\",1,0)+IF(AA22=\"L\",1,0)+IF(AA23=\"L\",1,0)+IF(AA24=\"L\",1,0)+IF(AA25=\"L\",1,0)+IF(AA26=\"L\",1,0)+IF(AA27=\"L\",1,0)+IF(AA28=\"L\",1,0)+IF(AA29=\"L\",1,0)+IF(AA30=\"L\",1,0)+IF(AA31=\"L\",1,0)","v":0},{"$f":"IF(AA19=\"D\",1,0)+IF(AA20=\"D\",1,0)+IF(AA21=\"D\",1,0)+IF(AA22=\"D\",1,0)+IF(AA23=\"D\",1,0)+IF(AA24=\"D\",1,0)+IF(AA25=\"D\",1,0)+IF(AA26=\"D\",1,0)+IF(AA27=\"D\",1,0)+IF(AA28=\"D\",1,0)+IF(AA29=\"D\",1,0)+IF(AA30=\"D\",1,0)+IF(AA31=\"D\",1,0)","v":0},{"$f":"IF(AA19=\"W\",1,0)+IF(AA20=\"W\",1,0)+IF(AA21=\"W\",1,0)+IF(AA22=\"W\",1,0)+IF(AA23=\"W\",1,0)+IF(AA24=\"W\",1,0)+IF(AA25=\"W\",1,0)+IF(AA26=\"W\",1,0)+IF(AA27=\"W\",1,0)+IF(AA28=\"W\",1,0)+IF(AA29=\"W\",1,0)+IF(AA30=\"W\",1,0)+IF(AA31=\"W\",1,0)","v":0},{"$f":"IF(AD19=\"L\",1,0)+IF(AD20=\"L\",1,0)+IF(AD21=\"L\",1,0)+IF(AD22=\"L\",1,0)+IF(AD23=\"L\",1,0)+IF(AD24=\"L\",1,0)+IF(AD25=\"L\",1,0)+IF(AD26=\"L\",1,0)+IF(AD27=\"L\",1,0)+IF(AD28=\"L\",1,0)+IF(AD29=\"L\",1,0)+IF(AD30=\"L\",1,0)+IF(AD31=\"L\",1,0)","v":0},{"$f":"IF(AD19=\"D\",1,0)+IF(AD20=\"D\",1,0)+IF(AD21=\"D\",1,0)+IF(AD22=\"D\",1,0)+IF(AD23=\"D\",1,0)+IF(AD24=\"D\",1,0)+IF(AD25=\"D\",1,0)+IF(AD26=\"D\",1,0)+IF(AD27=\"D\",1,0)+IF(AD28=\"D\",1,0)+IF(AD29=\"D\",1,0)+IF(AD30=\"D\",1,0)+IF(AD31=\"D\",1,0)","v":0},{"$f":"IF(AD19=\"W\",1,0)+IF(AD20=\"W\",1,0)+IF(AD21=\"W\",1,0)+IF(AD22=\"W\",1,0)+IF(AD23=\"W\",1,0)+IF(AD24=\"W\",1,0)+IF(AD25=\"W\",1,0)+IF(AD26=\"W\",1,0)+IF(AD27=\"W\",1,0)+IF(AD28=\"W\",1,0)+IF(AD29=\"W\",1,0)+IF(AD30=\"W\",1,0)+IF(AD31=\"W\",1,0)","v":0},{"$f":"IF(AG19=\"L\",1,0)+IF(AG20=\"L\",1,0)+IF(AG21=\"L\",1,0)+IF(AG22=\"L\",1,0)+IF(AG23=\"L\",1,0)+IF(AG24=\"L\",1,0)+IF(AG25=\"L\",1,0)+IF(AG26=\"L\",1,0)+IF(AG27=\"L\",1,0)+IF(AG28=\"L\",1,0)+IF(AG29=\"L\",1,0)+IF(AG30=\"L\",1,0)+IF(AG31=\"L\",1,0)","v":0},{"$f":"IF(AG19=\"D\",1,0)+IF(AG20=\"D\",1,0)+IF(AG21=\"D\",1,0)+IF(AG22=\"D\",1,0)+IF(AG23=\"D\",1,0)+IF(AG24=\"D\",1,0)+IF(AG25=\"D\",1,0)+IF(AG26=\"D\",1,0)+IF(AG27=\"D\",1,0)+IF(AG28=\"D\",1,0)+IF(AG29=\"D\",1,0)+IF(AG30=\"D\",1,0)+IF(AG31=\"D\",1,0)","v":0},{"$f":"IF(AG19=\"W\",1,0)+IF(AG20=\"W\",1,0)+IF(AG21=\"W\",1,0)+IF(AG22=\"W\",1,0)+IF(AG23=\"W\",1,0)+IF(AG24=\"W\",1,0)+IF(AG25=\"W\",1,0)+IF(AG26=\"W\",1,0)+IF(AG27=\"W\",1,0)+IF(AG28=\"W\",1,0)+IF(AG29=\"W\",1,0)+IF(AG30=\"W\",1,0)+IF(AG31=\"W\",1,0)","v":0},{"$f":"IF(AJ19=\"L\",1,0)+IF(AJ20=\"L\",1,0)+IF(AJ21=\"L\",1,0)+IF(AJ22=\"L\",1,0)+IF(AJ23=\"L\",1,0)+IF(AJ24=\"L\",1,0)+IF(AJ25=\"L\",1,0)+IF(AJ26=\"L\",1,0)+IF(AJ27=\"L\",1,0)+IF(AJ28=\"L\",1,0)+IF(AJ29=\"L\",1,0)+IF(AJ30=\"L\",1,0)+IF(AJ31=\"L\",1,0)","v":0},{"$f":"IF(AJ19=\"D\",1,0)+IF(AJ20=\"D\",1,0)+IF(AJ21=\"D\",1,0)+IF(AJ22=\"D\",1,0)+IF(AJ23=\"D\",1,0)+IF(AJ24=\"D\",1,0)+IF(AJ25=\"D\",1,0)+IF(AJ26=\"D\",1,0)+IF(AJ27=\"D\",1,0)+IF(AJ28=\"D\",1,0)+IF(AJ29=\"D\",1,0)+IF(AJ30=\"D\",1,0)+IF(AJ31=\"D\",1,0)","v":0},{"$f":"IF(AJ19=\"W\",1,0)+IF(AJ20=\"W\",1,0)+IF(AJ21=\"W\",1,0)+IF(AJ22=\"W\",1,0)+IF(AJ23=\"W\",1,0)+IF(AJ24=\"W\",1,0)+IF(AJ25=\"W\",1,0)+IF(AJ26=\"W\",1,0)+IF(AJ27=\"W\",1,0)+IF(AJ28=\"W\",1,0)+IF(AJ29=\"W\",1,0)+IF(AJ30=\"W\",1,0)+IF(AJ31=\"W\",1,0)","v":0},{"$f":"IF(AM19=\"L\",1,0)+IF(AM20=\"L\",1,0)+IF(AM21=\"L\",1,0)+IF(AM22=\"L\",1,0)+IF(AM23=\"L\",1,0)+IF(AM24=\"L\",1,0)+IF(AM25=\"L\",1,0)+IF(AM26=\"L\",1,0)+IF(AM27=\"L\",1,0)+IF(AM28=\"L\",1,0)+IF(AM29=\"L\",1,0)+IF(AM30=\"L\",1,0)+IF(AM31=\"L\",1,0)","v":0},{"$f":"IF(AM19=\"D\",1,0)+IF(AM20=\"D\",1,0)+IF(AM21=\"D\",1,0)+IF(AM22=\"D\",1,0)+IF(AM23=\"D\",1,0)+IF(AM24=\"D\",1,0)+IF(AM25=\"D\",1,0)+IF(AM26=\"D\",1,0)+IF(AM27=\"D\",1,0)+IF(AM28=\"D\",1,0)+IF(AM29=\"D\",1,0)+IF(AM30=\"D\",1,0)+IF(AM31=\"D\",1,0)","v":0},{"$f":"IF(AM19=\"W\",1,0)+IF(AM20=\"W\",1,0)+IF(AM21=\"W\",1,0)+IF(AM22=\"W\",1,0)+IF(AM23=\"W\",1,0)+IF(AM24=\"W\",1,0)+IF(AM25=\"W\",1,0)+IF(AM26=\"W\",1,0)+IF(AM27=\"W\",1,0)+IF(AM28=\"W\",1,0)+IF(AM29=\"W\",1,0)+IF(AM30=\"W\",1,0)+IF(AM31=\"W\",1,0)","v":0},{"$f":"IF(AP19=\"L\",1,0)+IF(AP20=\"L\",1,0)+IF(AP21=\"L\",1,0)+IF(AP22=\"L\",1,0)+IF(AP23=\"L\",1,0)+IF(AP24=\"L\",1,0)+IF(AP25=\"L\",1,0)+IF(AP26=\"L\",1,0)+IF(AP27=\"L\",1,0)+IF(AP28=\"L\",1,0)+IF(AP29=\"L\",1,0)+IF(AP30=\"L\",1,0)+IF(AP31=\"L\",1,0)","v":0},{"$f":"IF(AP19=\"D\",1,0)+IF(AP20=\"D\",1,0)+IF(AP21=\"D\",1,0)+IF(AP22=\"D\",1,0)+IF(AP23=\"D\",1,0)+IF(AP24=\"D\",1,0)+IF(AP25=\"D\",1,0)+IF(AP26=\"D\",1,0)+IF(AP27=\"D\",1,0)+IF(AP28=\"D\",1,0)+IF(AP29=\"D\",1,0)+IF(AP30=\"D\",1,0)+IF(AP31=\"D\",1,0)","v":0},{"$f":"IF(AP19=\"W\",1,0)+IF(AP20=\"W\",1,0)+IF(AP21=\"W\",1,0)+IF(AP22=\"W\",1,0)+IF(AP23=\"W\",1,0)+IF(AP24=\"W\",1,0)+IF(AP25=\"W\",1,0)+IF(AP26=\"W\",1,0)+IF(AP27=\"W\",1,0)+IF(AP28=\"W\",1,0)+IF(AP29=\"W\",1,0)+IF(AP30=\"W\",1,0)+IF(AP31=\"W\",1,0)","v":0}]
[null,"F/A",null,null,{"$f":"SUM(E19)+SUM(E20)+SUM(E21)+SUM(E22)+SUM(E23)+SUM(E24)+SUM(E25)+SUM(E26)+SUM(E27)+SUM(E28)+SUM(E29)+SUM(E30)+SUM(E31)","v":0},{"$f":"SUM(D19)+SUM(D20)+SUM(D21)+SUM(D22)+SUM(D23)+SUM(D24)+SUM(D25)+SUM(D26)+SUM(D27)+SUM(D28)+SUM(D29)+SUM(D30)+SUM(D31)","v":0},null,{"$f":"SUM(H19)+SUM(H20)+SUM(H21)+SUM(H22)+SUM(H23)+SUM(H24)+SUM(H25)+SUM(H26)+SUM(H27)+SUM(H28)+SUM(H29)+SUM(H30)+SUM(H31)","v":0},{"$f":"SUM(G19)+SUM(G20)+SUM(G21)+SUM(G22)+SUM(G23)+SUM(G24)+SUM(G25)+SUM(G26)+SUM(G27)+SUM(G28)+SUM(G29)+SUM(G30)+SUM(G31)","v":0},null,{"$f":"SUM(K19)+SUM(K20)+SUM(K21)+SUM(K22)+SUM(K23)+SUM(K24)+SUM(K25)+SUM(K26)+SUM(K27)+SUM(K28)+SUM(K29)+SUM(K30)+SUM(K31)","v":0},{"$f":"SUM(J19)+SUM(J20)+SUM(J21)+SUM(J22)+SUM(J23)+SUM(J24)+SUM(J25)+SUM(J26)+SUM(J27)+SUM(J28)+SUM(J29)+SUM(J30)+SUM(J31)","v":0},null,{"$f":"SUM(N19)+SUM(N20)+SUM(N21)+SUM(N22)+SUM(N23)+SUM(N24)+SUM(N25)+SUM(N26)+SUM(N27)+SUM(N28)+SUM(N29)+SUM(N30)+SUM(N31)","v":0},{"$f":"SUM(M19)+SUM(M20)+SUM(M21)+SUM(M22)+SUM(M23)+SUM(M24)+SUM(M25)+SUM(M26)+SUM(M27)+SUM(M28)+SUM(M29)+SUM(M30)+SUM(M31)","v":0},null,{"$f":"SUM(Q19)+SUM(Q20)+SUM(Q21)+SUM(Q22)+SUM(Q23)+SUM(Q24)+SUM(Q25)+SUM(Q26)+SUM(Q27)+SUM(Q28)+SUM(Q29)+SUM(Q30)+SUM(Q31)","v":0},{"$f":"SUM(P19)+SUM(P20)+SUM(P21)+SUM(P22)+SUM(P23)+SUM(P24)+SUM(P25)+SUM(P26)+SUM(P27)+SUM(P28)+SUM(P29)+SUM(P30)+SUM(P31)","v":0},null,{"$f":"SUM(T19)+SUM(T20)+SUM(T21)+SUM(T22)+SUM(T23)+SUM(T24)+SUM(T25)+SUM(T26)+SUM(T27)+SUM(T28)+SUM(T29)+SUM(T30)+SUM(T31)","v":0},{"$f":"SUM(S19)+SUM(S20)+SUM(S21)+SUM(S22)+SUM(S23)+SUM(S24)+SUM(S25)+SUM(S26)+SUM(S27)+SUM(S28)+SUM(S29)+SUM(S30)+SUM(S31)","v":0},null,{"$f":"SUM(W19)+SUM(W20)+SUM(W21)+SUM(W22)+SUM(W23)+SUM(W24)+SUM(W25)+SUM(W26)+SUM(W27)+SUM(W28)+SUM(W29)+SUM(W30)+SUM(W31)","v":0},{"$f":"SUM(V19)+SUM(V20)+SUM(V21)+SUM(V22)+SUM(V23)+SUM(V24)+SUM(V25)+SUM(V26)+SUM(V27)+SUM(V28)+SUM(V29)+SUM(V30)+SUM(V31)","v":0},null,{"$f":"SUM(Z19)+SUM(Z20)+SUM(Z21)+SUM(Z22)+SUM(Z23)+SUM(Z24)+SUM(Z25)+SUM(Z26)+SUM(Z27)+SUM(Z28)+SUM(Z29)+SUM(Z30)+SUM(Z31)","v":0},{"$f":"SUM(Y19)+SUM(Y20)+SUM(Y21)+SUM(Y22)+SUM(Y23)+SUM(Y24)+SUM(Y25)+SUM(Y26)+SUM(Y27)+SUM(Y28)+SUM(Y29)+SUM(Y30)+SUM(Y31)","v":0},null,{"$f":"SUM(AC19)+SUM(AC20)+SUM(AC21)+SUM(AC22)+SUM(AC23)+SUM(AC24)+SUM(AC25)+SUM(AC26)+SUM(AC27)+SUM(AC28)+SUM(AC29)+SUM(AC30)+SUM(AC31)","v":0},{"$f":"SUM(AB19)+SUM(AB20)+SUM(AB21)+SUM(AB22)+SUM(AB23)+SUM(AB24)+SUM(AB25)+SUM(AB26)+SUM(AB27)+SUM(AB28)+SUM(AB29)+SUM(AB30)+SUM(AB31)","v":0},null,{"$f":"SUM(AF19)+SUM(AF20)+SUM(AF21)+SUM(AF22)+SUM(AF23)+SUM(AF24)+SUM(AF25)+SUM(AF26)+SUM(AF27)+SUM(AF28)+SUM(AF29)+SUM(AF30)+SUM(AF31)","v":0},{"$f":"SUM(AE19)+SUM(AE20)+SUM(AE21)+SUM(AE22)+SUM(AE23)+SUM(AE24)+SUM(AE25)+SUM(AE26)+SUM(AE27)+SUM(AE28)+SUM(AE29)+SUM(AE30)+SUM(AE31)","v":0},null,{"$f":"SUM(AI19)+SUM(AI20)+SUM(AI21)+SUM(AI22)+SUM(AI23)+SUM(AI24)+SUM(AI25)+SUM(AI26)+SUM(AI27)+SUM(AI28)+SUM(AI29)+SUM(AI30)+SUM(AI31)","v":0},{"$f":"SUM(AH19)+SUM(AH20)+SUM(AH21)+SUM(AH22)+SUM(AH23)+SUM(AH24)+SUM(AH25)+SUM(AH26)+SUM(AH27)+SUM(AH28)+SUM(AH29)+SUM(AH30)+SUM(AH31)","v":0},null,{"$f":"SUM(AL19)+SUM(AL20)+SUM(AL21)+SUM(AL22)+SUM(AL23)+SUM(AL24)+SUM(AL25)+SUM(AL26)+SUM(AL27)+SUM(AL28)+SUM(AL29)+SUM(AL30)+SUM(AL31)","v":0},{"$f":"SUM(AK19)+SUM(AK20)+SUM(AK21)+SUM(AK22)+SUM(AK23)+SUM(AK24)+SUM(AK25)+SUM(AK26)+SUM(AK27)+SUM(AK28)+SUM(AK29)+SUM(AK30)+SUM(AK31)","v":0},null,{"$f":"SUM(AO19)+SUM(AO20)+SUM(AO21)+SUM(AO22)+SUM(AO23)+SUM(AO24)+SUM(AO25)+SUM(AO26)+SUM(AO27)+SUM(AO28)+SUM(AO29)+SUM(AO30)+SUM(AO31)","v":0},{"$f":"SUM(AN19)+SUM(AN20)+SUM(AN21)+SUM(AN22)+SUM(AN23)+SUM(AN24)+SUM(AN25)+SUM(AN26)+SUM(AN27)+SUM(AN28)+SUM(AN29)+SUM(AN30)+SUM(AN31)","v":0},null,{"$f":"SUM(AR19:AR31)","v":0},null,null,null,null,null,null,null,null,null,null,null,null,null,{"$f":"AP35","v":""}]
[null,null,null,null,null,null,null,null,null,null,null,null,null,null,null,null,null,null,null,null,null,null,null,null,null,null,null,null,null,null,null,null,null,null,null,null,null,null,null,null,null,null,null,"P","W","D","L","F","A","GD","Pts",null,"P","W","D","L","F","A","GD","Pts",null,"P","W","D","L","F","A","GD","Pts"]
[null,{"$f":"B19","v":"CCM"},"Central Coast Mariners",null,null,{"$f":"IF(D35=\"\",\"\",IF(E35=\"\",\"\",IF(D35>E35,\"W\",IF(D35=E35,\"D\",IF(D35<E35,\"L\")))))","v":""},null,null,{"$f":"IF(G35=\"\",\"\",IF(H35=\"\",\"\",IF(G35>H35,\"W\",IF(G35=H35,\"D\",IF(G35<H35,\"L\")))))","v":""},null,null,{"$f":"IF(J35=\"\",\"\",IF(K35=\"\",\"\",IF(J35>K35,\"W\",IF(J35=K35,\"D\",IF(J35<K35,\"L\")))))","v":""},null,null,{"$f":"IF(M35=\"\",\"\",IF(N35=\"\",\"\",IF(M35>N35,\"W\",IF(M35=N35,\"D\",IF(M35<N35,\"L\")))))","v":""},null,null,{"$f":"IF(P35=\"\",\"\",IF(Q35=\"\",\"\",IF(P35>Q35,\"W\",IF(P35=Q35,\"D\",IF(P35<Q35,\"L\")))))","v":""},null,null,{"$f":"IF(S35=\"\",\"\",IF(T35=\"\",\"\",IF(S35>T35,\"W\",IF(S35=T35,\"D\",IF(S35<T35,\"L\")))))","v":""},null,null,{"$f":"IF(V35=\"\",\"\",IF(W35=\"\",\"\",IF(V35>W35,\"W\",IF(V35=W35,\"D\",IF(V35<W35,\"L\")))))","v":""},null,null,{"$f":"IF(Y35=\"\",\"\",IF(Z35=\"\",\"\",IF(Y35>Z35,\"W\",IF(Y35=Z35,\"D\",IF(Y35<Z35,\"L\")))))","v":""},null,null,{"$f":"IF(AB35=\"\",\"\",IF(AC35=\"\",\"\",IF(AB35>AC35,\"W\",IF(AB35=AC35,\"D\",IF(AB35<AC35,\"L\")))))","v":""},null,null,{"$f":"IF(AE35=\"\",\"\",IF(AF35=\"\",\"\",IF(AE35>AF35,\"W\",IF(AE35=AF35,\"D\",IF(AE35<AF35,\"L\")))))","v":""},null,null,{"$f":"IF(AH35=\"\",\"\",IF(AI35=\"\",\"\",IF(AH35>AI35,\"W\",IF(AH35=AI35,\"D\",IF(AH35<AI35,\"L\")))))","v":""},null,null,{"$f":"IF(AK35=\"\",\"\",IF(AL35=\"\",\"\",IF(AK35>AL35,\"W\",IF(AK35=AL35,\"D\",IF(AK35<AL35,\"L\")))))","v":""},null,null,{"$f":"IF(AN35=\"\",\"\",IF(AO35=\"\",\"\",IF(AN35>AO35,\"W\",IF(AN35=AO35,\"D\",IF(AN35<AO35,\"L\")))))","v":""},{"$f":"C35","v":"Central Coast Mariners"},{"$f":"SUM(AS35:AU35)","v":0},{"$f":"IF(F35=\"W\",1,0)+IF(I35=\"W\",1,0)+IF(L35=\"W\",1,0)+IF(O35=\"W\",1,0)+IF(R35=\"W\",1,0)+IF(U35=\"W\",1,0)+IF(X35=\"W\",1,0)+IF(AA35=\"W\",1,0)+IF(AD35=\"W\",1,0)+IF(AG35=\"W\",1,0)+IF(AJ35=\"W\",1,0)+IF(AM35=\"W\",1,0)+IF(AP35=\"W\",1,0)","v":0},{"$f":"IF(F35=\"D\",1,0)+IF(I35=\"D\",1,0)+IF(L35=\"D\",1,0)+IF(O35=\"D\",1,0)+IF(R35=\"D\",1,0)+IF(U35=\"D\",1,0)+IF(X35=\"D\",1,0)+IF(AA35=\"D\",1,0)+IF(AD35=\"D\",1,0)+IF(AG35=\"D\",1,0)+IF(AJ35=\"D\",1,0)+IF(AM35=\"D\",1,0)+IF(AP35=\"D\",1,0)","v":0},{"$f":"IF(F35=\"L\",1,0)+IF(I35=\"L\",1,0)+IF(L35=\"L\",1,0)+IF(O35=\"L\",1,0)+IF(R35=\"L\",1,0)+IF(U35=\"L\",1,0)+IF(X35=\"L\",1,0)+IF(AA35=\"L\",1,0)+IF(AD35=\"L\",1,0)+IF(AG35=\"L\",1,0)+IF(AJ35=\"L\",1,0)+IF(AM35=\"L\",1,0)+IF(AP35=\"L\",1,0)","v":0},{"$f":"SUM(D35)+SUM(G35)+SUM(J35)+SUM(M35)+SUM(P35)+SUM(S35)+SUM(V35)+SUM(Y35)+SUM(AB35)+SUM(AE35)+SUM(AH35)+SUM(AK35)+SUM(AN35)","v":0},{"$f":"SUM(E35)+SUM(H35)+SUM(K35)+SUM(N35)+SUM(Q35)+SUM(T35)+SUM(W35)+SUM(Z35)+SUM(AC35)+SUM(AF35)+SUM(AI35)+SUM(AL35)+SUM(AO35)","v":0},{"$f":"AV35-AW35","v":0},{"$f":"AS35*3+AT35","v":0},null,{"$f":"SUM(BB35:BD35)","v":0},{"$f":"D48","v":0},{"$f":"E48","v":0},{"$f":"F48","v":0},{"$f":"E49","v":0},{"$f":"F49","v":0},{"$f":"BE35-BF35","v":0},{"$f":"BB35*3+BC35","v":0},null,{"$f":"AR35+BA35","v":0},{"$f":"AS35+BB35","v":0},{"$f":"AT35+BC35","v":0},{"$f":"AU35+BD35","v":0},{"$f":"AV35+BE35","v":0},{"$f":"AW35+BF35","v":0},{"$f":"AX35+BG35","v":0},{"$f":"AY35+BH35","v":0}]
[null,"UCK","Auckland FC",null,null,"",null,null,"",null,null,"",null,null,"",null,null,"",null,null,"",null,null,{"$f":"IF(V36=\"\",\"\",IF(W36=\"\",\"\",IF(V36>W36,\"W\",IF(V36=W36,\"D\",IF(V36<W36,\"L\")))))","v":""},null,null,"",null,null,"",null,null,"",null,null,"",null,null,"",null,null,"","Auckland FC",{"$f":"SUM(AS36:AU36)","v":0},{"$f":"IF(F36=\"W\",1,0)+IF(I36=\"W\",1,0)+IF(L36=\"W\",1,0)+IF(O36=\"W\",1,0)+IF(R36=\"W\",1,0)+IF(U36=\"W\",1,0)+IF(X36=\"W\",1,0)+IF(AA36=\"W\",1,0)+IF(AD36=\"W\",1,0)+IF(AG36=\"W\",1,0)+IF(AJ36=\"W\",1,0)+IF(AM36=\"W\",1,0)+IF(AP36=\"W\",1,0)","v":0},{"$f":"IF(F36=\"D\",1,0)+IF(I36=\"D\",1,0)+IF(L36=\"D\",1,0)+IF(O36=\"D\",1,0)+IF(R36=\"D\",1,0)+IF(U36=\"D\",1,0)+IF(X36=\"D\",1,0)+IF(AA36=\"D\",1,0)+IF(AD36=\"D\",1,0)+IF(AG36=\"D\",1,0)+IF(AJ36=\"D\",1,0)+IF(AM36=\"D\",1,0)+IF(AP36=\"D\",1,0)","v":0},{"$f":"IF(F36=\"L\",1,0)+IF(I36=\"L\",1,0)+IF(L36=\"L\",1,0)+IF(O36=\"L\",1,0)+IF(R36=\"L\",1,0)+IF(U36=\"L\",1,0)+IF(X36=\"L\",1,0)+IF(AA36=\"L\",1,0)+IF(AD36=\"L\",1,0)+IF(AG36=\"L\",1,0)+IF(AJ36=\"L\",1,0)+IF(AM36=\"L\",1,0)+IF(AP36=\"L\",1,0)","v":0},{"$f":"SUM(D36)+SUM(G36)+SUM(J36)+SUM(M36)+SUM(P36)+SUM(S36)+SUM(V36)+SUM(Y36)+SUM(AB36)+SUM(AE36)+SUM(AH36)+SUM(AK36)+SUM(AN36)","v":0},{"$f":"SUM(E36)+SUM(H36)+SUM(K36)+SUM(N36)+SUM(Q36)+SUM(T36)+SUM(W36)+SUM(Z36)+SUM(AC36)+SUM(AF36)+SUM(AI36)+SUM(AL36)+SUM(AO36)","v":0},{"$f":"AV36-AW36","v":0},{"$f":"AS36*3+AT36","v":0},null,{"$f":"SUM(BB36:BD36)","v":0},{"$f":"G48","v":0},{"$f":"H48","v":0},{"$f":"I48","v":0},{"$f":"H49","v":0},{"$f":"I49","v":0},{"$f":"BE36-BF36","v":0},{"$f":"BB36*3+BC36","v":0},null,{"$f":"AR36+BA36","v":0},{"$f":"AS36+BB36","v":0},0,0,0,0,{"$f":"AX36+BG36","v":0},0]
[null,"NEW","Newcastle Jets",null,null,"",null,null,"",null,null,"",null,null,"",null,null,"",null,null,"",null,null,"",null,null,"",null,null,"",null,null,"",null,null,"",null,null,"",null,null,"","Newcastle Jets",{"$f":"SUM(AS37:AU37)","v":0},0,0,0,0,0,0,0,null,0,{"$f":"J48","v":0},{"$f":"K48","v":0},{"$f":"L48","v":0},{"$f":"K49","v":0},{"$f":"L49","v":0},0,0,null,{"$f":"AR37+BA37","v":0},{"$f":"AS37+BB37","v":0},0,0,0,0,{"$f":"AX37+BG37","v":0},0]
[null,"WSW","Western Sydney Wanderers FC",null,null,"",null,null,"",null,null,"",null,null,"",null,null,"",null,null,"",null,null,"",null,null,"",null,null,"",null,null,"",null,null,"",null,null,"",null,null,"","Western Sydney Wanderers FC",0,0,0,0,0,0,0,0,null,0,{"$f":"M48","v":0},{"$f":"N48","v":0},{"$f":"O48","v":0},{"$f":"N49","v":0},{"$f":"O49","v":0},0,0,null,{"$f":"AR38+BA38","v":0},0,0,0,0,0,0,0]
[null,"PHX","Wellington Phoenix",null,null,"",null,null,"",null,null,"",null,null,"",null,null,"",null,null,"",null,null,"",null,null,"",null,null,"",null,null,"",null,null,"",null,null,"",null,null,"","Wellington Phoenix",{"$f":"SUM(AS39:AU39)","v":0},0,0,0,0,0,0,0,null,0,{"$f":"P48","v":0},{"$f":"Q48","v":0},{"$f":"R48","v":0},{"$f":"Q49","v":0},{"$f":"R49","v":0},0,0,null,0,0,0,0,0,0,0,0]
[null,"MAC","Macarthur FC",null,null,"",null,null,"",null,null,"",null,null,"",null,null,"",null,null,"",null,null,"",null,null,"",null,null,"",null,null,"",null,null,"",null,null,"",null,null,"","Macarthur FC",{"$f":"SUM(AS40:AU40)","v":0},0,0,0,0,0,0,0,null,0,{"$f":"S48","v":0},{"$f":"T48","v":0},{"$f":"U48","v":0},{"$f":"T49","v":0},{"$f":"U49","v":0},0,0,null,{"$f":"AR40+BA40","v":0},{"$f":"AS40+BB40","v":0},0,0,0,0,0,0]
[null,"ADU","Adelaide United",null,null,null,null,null,null,null,null,null,null,null,null,null,null,null,null,null,null,null,null,null,null,null,null,null,null,null,null,null,null,null,null,null,null,null,null,null,null,null,"Adelaide United",{"$f":"SUM(AS41:AU41)","v":0},0,0,0,0,0,0,0,null,{"$f":"SUM(BB41:BD41)","v":0},{"$f":"V48","v":0},{"$f":"W48","v":0},{"$f":"X48","v":0},{"$f":"W49","v":0},{"$f":"X49","v":0},0,0,null,{"$f":"AR41+BA41","v":0},{"$f":"AS41+BB41","v":0},0,0,0,0,0,0]
[null,"VIC","Melbourne Victory",null,null,"",null,null,"",null,null,"",null,null,"",null,null,"",null,null,"",null,null,{"$f":"IF(V42=\"\",\"\",IF(W42=\"\",\"\",IF(V42>W42,\"W\",IF(V42=W42,\"D\",IF(V42<W42,\"L\")))))","v":""},null,null,"",null,null,"",null,null,"",null,null,"",null,null,"",null,null,"","Melbourne Victory",{"$f":"SUM(AS42:AU42)","v":0},0,0,0,0,0,0,0,null,{"$f":"SUM(BB42:BD42)","v":0},{"$f":"Y48","v":0},{"$f":"Z48","v":0},{"$f":"AA48","v":0},{"$f":"Z49","v":0},{"$f":"AA49","v":0},0,0,null,0,{"$f":"AS42+BB42","v":0},{"$f":"AT42+BC42","v":0},{"$f":"AU42+BD42","v":0},{"$f":"AV42+BE42","v":0},{"$f":"AW42+BF42","v":0},{"$f":"AX42+BG42","v":0},{"$f":"AY42+BH42","v":0}]
[null,"BRI","Brisbane Roar FC",null,null,"",null,null,"",null,null,"",null,null,"",null,null,"",null,null,"",null,null,"",null,null,"",null,null,"",null,null,"",null,null,"",null,null,"",null,null,"","Brisbane Roar FC",0,0,0,0,0,0,0,0,null,0,{"$f":"AB48","v":0},{"$f":"AC48","v":0},{"$f":"AD48","v":0},{"$f":"AC49","v":0},{"$f":"AD49","v":0},0,0,null,0,0,0,0,0,0,0,0]
[null,"MCT","Melbourne City FC",null,null,"",null,null,"",null,null,"",null,null,"",null,null,"",null,null,"",null,null,"",null,null,"",null,null,"",null,null,"",null,null,"",null,null,"",null,null,"","Melbourne City FC",0,0,0,0,0,0,0,0,null,0,{"$f":"AE48","v":0},{"$f":"AF48","v":0},{"$f":"AG48","v":0},{"$f":"AF49","v":0},{"$f":"AG49","v":0},0,0,null,0,0,0,0,0,0,0,0]
[null,"SYD","Sydney FC",null,null,"",null,null,"",null,null,"",null,null,"",null,null,"",null,null,"",null,null,"",null,null,"",null,null,"",null,null,"",null,null,"",null,null,"",null,null,"","Sydney FC",{"$f":"SUM(AS45:AU45)","v":0},0,0,0,0,0,0,0,null,{"$f":"SUM(BB45:BD45)","v":0},{"$f":"AH48","v":0},{"$f":"AI48","v":0},{"$f":"AJ48","v":0},{"$f":"AI49","v":0},{"$f":"AJ49","v":0},{"$f":"BE45-BF45","v":0},{"$f":"BB45*3+BC45","v":0},null,{"$f":"AR45+BA45","v":0},0,0,0,0,0,0,0]
[null,"WUT","Western United FC",null,null,"",null,null,"",null,null,"",null,null,"",null,null,"",null,null,"",null,null,"",null,null,"",null,null,"",null,null,"",null,null,"",null,null,"",null,null,"","Western United FC",{"$f":"SUM(AS46:AU46)","v":0},0,0,0,0,0,0,0,null,{"$f":"SUM(BB46:BD46)","v":0},{"$f":"AK48","v":0},{"$f":"AL48","v":0},{"$f":"AM48","v":0},{"$f":"AL49","v":0},{"$f":"AM49","v":0},{"$f":"BE46-BF46","v":0},{"$f":"BB46*3+BC46","v":0},null,{"$f":"AR46+BA46","v":0},0,0,{"$f":"AU46+BD46","v":0},0,0,0,0]
[null,"GLO","Perth Glory",null,null,"",null,null,"",null,null,"",null,null,"",null,null,"",null,null,"",null,null,"",null,null,"",null,null,"",null,null,"",null,null,"",null,null,"",null,null,"","Perth Glory",{"$f":"SUM(AS47:AU47)","v":0},0,0,0,0,0,0,0,null,{"$f":"SUM(BB47:BD47)","v":0},{"$f":"AN48","v":0},{"$f":"AO48","v":0},{"$f":"AP48","v":0},{"$f":"AO49","v":0},{"$f":"AP49","v":0},{"$f":"BE47-BF47","v":0},{"$f":"BB47*3+BC47","v":0},null,0,{"$f":"AS47+BB47","v":0},0,{"$f":"AU47+BD47","v":0},0,0,{"$f":"AX47+BG47","v":0},0]
[null,"W/D/L",null,{"$f":"IF(F35=\"L\",1,0)+IF(F36=\"L\",1,0)+IF(F37=\"L\",1,0)+IF(F38=\"L\",1,0)+IF(F39=\"L\",1,0)+IF(F40=\"L\",1,0)+IF(F42=\"L\",1,0)+IF(F43=\"L\",1,0)+IF(F44=\"L\",1,0)+IF(F45=\"L\",1,0)+IF(F46=\"L\",1,0)+IF(F47=\"L\",1,0)","v":0},{"$f":"IF(F35=\"D\",1,0)+IF(F36=\"D\",1,0)+IF(F37=\"D\",1,0)+IF(F38=\"D\",1,0)+IF(F39=\"D\",1,0)+IF(F40=\"D\",1,0)+IF(F42=\"D\",1,0)+IF(F43=\"D\",1,0)+IF(F44=\"D\",1,0)+IF(F45=\"D\",1,0)+IF(F46=\"D\",1,0)+IF(F47=\"D\",1,0)","v":0},{"$f":"IF(F35=\"W\",1,0)+IF(F36=\"W\",1,0)+IF(F37=\"W\",1,0)+IF(F38=\"W\",1,0)+IF(F39=\"W\",1,0)+IF(F40=\"W\",1,0)+IF(F42=\"W\",1,0)+IF(F43=\"W\",1,0)+IF(F44=\"W\",1,0)+IF(F45=\"W\",1,0)+IF(F46=\"W\",1,0)+IF(F47=\"W\",1,0)","v":0},{"$f":"IF(I35=\"L\",1,0)+IF(I36=\"L\",1,0)+IF(I37=\"L\",1,0)+IF(I38=\"L\",1,0)+IF(I39=\"L\",1,0)+IF(I40=\"L\",1,0)+IF(I42=\"L\",1,0)+IF(I43=\"L\",1,0)+IF(I44=\"L\",1,0)+IF(I45=\"L\",1,0)+IF(I46=\"L\",1,0)+IF(I47=\"L\",1,0)","v":0},{"$f":"IF(I35=\"D\",1,0)+IF(I36=\"D\",1,0)+IF(I37=\"D\",1,0)+IF(I38=\"D\",1,0)+IF(I39=\"D\",1,0)+IF(I40=\"D\",1,0)+IF(I42=\"D\",1,0)+IF(I43=\"D\",1,0)+IF(I44=\"D\",1,0)+IF(I45=\"D\",1,0)+IF(I46=\"D\",1,0)+IF(I47=\"D\",1,0)","v":0},{"$f":"IF(I35=\"W\",1,0)+IF(I36=\"W\",1,0)+IF(I37=\"W\",1,0)+IF(I38=\"W\",1,0)+IF(I39=\"W\",1,0)+IF(I40=\"W\",1,0)+IF(I42=\"W\",1,0)+IF(I43=\"W\",1,0)+IF(I44=\"W\",1,0)+IF(I45=\"W\",1,0)+IF(I46=\"W\",1,0)+IF(I47=\"W\",1,0)","v":0},{"$f":"IF(L35=\"L\",1,0)+IF(L36=\"L\",1,0)+IF(L37=\"L\",1,0)+IF(L38=\"L\",1,0)+IF(L39=\"L\",1,0)+IF(L40=\"L\",1,0)+IF(L42=\"L\",1,0)+IF(L43=\"L\",1,0)+IF(L44=\"L\",1,0)+IF(L45=\"L\",1,0)+IF(L46=\"L\",1,0)+IF(L47=\"L\",1,0)","v":0},{"$f":"IF(L35=\"D\",1,0)+IF(L36=\"D\",1,0)+IF(L37=\"D\",1,0)+IF(L38=\"D\",1,0)+IF(L39=\"D\",1,0)+IF(L40=\"D\",1,0)+IF(L42=\"D\",1,0)+IF(L43=\"D\",1,0)+IF(L44=\"D\",1,0)+IF(L45=\"D\",1,0)+IF(L46=\"D\",1,0)+IF(L47=\"D\",1,0)","v":0},{"$f":"IF(L35=\"W\",1,0)+IF(L36=\"W\",1,0)+IF(L37=\"W\",1,0)+IF(L38=\"W\",1,0)+IF(L39=\"W\",1,0)+IF(L40=\"W\",1,0)+IF(L42=\"W\",1,0)+IF(L43=\"W\",1,0)+IF(L44=\"W\",1,0)+IF(L45=\"W\",1,0)+IF(L46=\"W\",1,0)+IF(L47=\"W\",1,0)","v":0},{"$f":"IF(O35=\"L\",1,0)+IF(O36=\"L\",1,0)+IF(O37=\"L\",1,0)+IF(O38=\"L\",1,0)+IF(O39=\"L\",1,0)+IF(O40=\"L\",1,0)+IF(O42=\"L\",1,0)+IF(O43=\"L\",1,0)+IF(O44=\"L\",1,0)+IF(O45=\"L\",1,0)+IF(O46=\"L\",1,0)+IF(O47=\"L\",1,0)","v":0},{"$f":"IF(O35=\"D\",1,0)+IF(O36=\"D\",1,0)+IF(O37=\"D\",1,0)+IF(O38=\"D\",1,0)+IF(O39=\"D\",1,0)+IF(O40=\"D\",1,0)+IF(O42=\"D\",1,0)+IF(O43=\"D\",1,0)+IF(O44=\"D\",1,0)+IF(O45=\"D\",1,0)+IF(O46=\"D\",1,0)+IF(O47=\"D\",1,0)","v":0},{"$f":"IF(O35=\"W\",1,0)+IF(O36=\"W\",1,0)+IF(O37=\"W\",1,0)+IF(O38=\"W\",1,0)+IF(O39=\"W\",1,0)+IF(O40=\"W\",1,0)+IF(O42=\"W\",1,0)+IF(O43=\"W\",1,0)+IF(O44=\"W\",1,0)+IF(O45=\"W\",1,0)+IF(O46=\"W\",1,0)+IF(O47=\"W\",1,0)","v":0},{"$f":"IF(R35=\"L\",1,0)+IF(R36=\"L\",1,0)+IF(R37=\"L\",1,0)+IF(R38=\"L\",1,0)+IF(R39=\"L\",1,0)+IF(R40=\"L\",1,0)+IF(R42=\"L\",1,0)+IF(R43=\"L\",1,0)+IF(R44=\"L\",1,0)+IF(R45=\"L\",1,0)+IF(R46=\"L\",1,0)+IF(R47=\"L\",1,0)","v":0},{"$f":"IF(R35=\"D\",1,0)+IF(R36=\"D\",1,0)+IF(R37=\"D\",1,0)+IF(R38=\"D\",1,0)+IF(R39=\"D\",1,0)+IF(R40=\"D\",1,0)+IF(R42=\"D\",1,0)+IF(R43=\"D\",1,0)+IF(R44=\"D\",1,0)+IF(R45=\"D\",1,0)+IF(R46=\"D\",1,0)+IF(R47=\"D\",1,0)","v":0},{"$f":"IF(R35=\"W\",1,0)+IF(R36=\"W\",1,0)+IF(R37=\"W\",1,0)+IF(R38=\"W\",1,0)+IF(R39=\"W\",1,0)+IF(R40=\"W\",1,0)+IF(R42=\"W\",1,0)+IF(R43=\"W\",1,0)+IF(R44=\"W\",1,0)+IF(R45=\"W\",1,0)+IF(R46=\"W\",1,0)+IF(R47=\"W\",1,0)","v":0},{"$f":"IF(U35=\"L\",1,0)+IF(U36=\"L\",1,0)+IF(U37=\"L\",1,0)+IF(U38=\"L\",1,0)+IF(U39=\"L\",1,0)+IF(U40=\"L\",1,0)+IF(U42=\"L\",1,0)+IF(U43=\"L\",1,0)+IF(U44=\"L\",1,0)+IF(U45=\"L\",1,0)+IF(U46=\"L\",1,0)+IF(U47=\"L\",1,0)","v":0},{"$f":"IF(U35=\"D\",1,0)+IF(U36=\"D\",1,0)+IF(U37=\"D\",1,0)+IF(U38=\"D\",1,0)+IF(U39=\"D\",1,0)+IF(U40=\"D\",1,0)+IF(U42=\"D\",1,0)+IF(U43=\"D\",1,0)+IF(U44=\"D\",1,0)+IF(U45=\"D\",1,0)+IF(U46=\"D\",1,0)+IF(U47=\"D\",1,0)","v":0},{"$f":"IF(U35=\"W\",1,0)+IF(U36=\"W\",1,0)+IF(U37=\"W\",1,0)+IF(U38=\"W\",1,0)+IF(U39=\"W\",1,0)+IF(U40=\"W\",1,0)+IF(U42=\"W\",1,0)+IF(U43=\"W\",1,0)+IF(U44=\"W\",1,0)+IF(U45=\"W\",1,0)+IF(U46=\"W\",1,0)+IF(U47=\"W\",1,0)","v":0},{"$f":"IF(X35=\"L\",1,0)+IF(X36=\"L\",1,0)+IF(X37=\"L\",1,0)+IF(X38=\"L\",1,0)+IF(X39=\"L\",1,0)+IF(X40=\"L\",1,0)+IF(X42=\"L\",1,0)+IF(X43=\"L\",1,0)+IF(X44=\"L\",1,0)+IF(X45=\"L\",1,0)+IF(X46=\"L\",1,0)+IF(X47=\"L\",1,0)","v":0},{"$f":"IF(X35=\"D\",1,0)+IF(X36=\"D\",1,0)+IF(X37=\"D\",1,0)+IF(X38=\"D\",1,0)+IF(X39=\"D\",1,0)+IF(X40=\"D\",1,0)+IF(X42=\"D\",1,0)+IF(X43=\"D\",1,0)+IF(X44=\"D\",1,0)+IF(X45=\"D\",1,0)+IF(X46=\"D\",1,0)+IF(X47=\"D\",1,0)","v":0},{"$f":"IF(X35=\"W\",1,0)+IF(X36=\"W\",1,0)+IF(X37=\"W\",1,0)+IF(X38=\"W\",1,0)+IF(X39=\"W\",1,0)+IF(X40=\"W\",1,0)+IF(X42=\"W\",1,0)+IF(X43=\"W\",1,0)+IF(X44=\"W\",1,0)+IF(X45=\"W\",1,0)+IF(X46=\"W\",1,0)+IF(X47=\"W\",1,0)","v":0},{"$f":"IF(AA35=\"L\",1,0)+IF(AA36=\"L\",1,0)+IF(AA37=\"L\",1,0)+IF(AA38=\"L\",1,0)+IF(AA39=\"L\",1,0)+IF(AA40=\"L\",1,0)+IF(AA42=\"L\",1,0)+IF(AA43=\"L\",1,0)+IF(AA44=\"L\",1,0)+IF(AA45=\"L\",1,0)+IF(AA46=\"L\",1,0)+IF(AA47=\"L\",1,0)","v":0},{"$f":"IF(AA35=\"D\",1,0)+IF(AA36=\"D\",1,0)+IF(AA37=\"D\",1,0)+IF(AA38=\"D\",1,0)+IF(AA39=\"D\",1,0)+IF(AA40=\"D\",1,0)+IF(AA42=\"D\",1,0)+IF(AA43=\"D\",1,0)+IF(AA44=\"D\",1,0)+IF(AA45=\"D\",1,0)+IF(AA46=\"D\",1,0)+IF(AA47=\"D\",1,0)","v":0},{"$f":"IF(AA35=\"W\",1,0)+IF(AA36=\"W\",1,0)+IF(AA37=\"W\",1,0)+IF(AA38=\"W\",1,0)+IF(AA39=\"W\",1,0)+IF(AA40=\"W\",1,0)+IF(AA42=\"W\",1,0)+IF(AA43=\"W\",1,0)+IF(AA44=\"W\",1,0)+IF(AA45=\"W\",1,0)+IF(AA46=\"W\",1,0)+IF(AA47=\"W\",1,0)","v":0},{"$f":"IF(AD35=\"L\",1,0)+IF(AD36=\"L\",1,0)+IF(AD37=\"L\",1,0)+IF(AD38=\"L\",1,0)+IF(AD39=\"L\",1,0)+IF(AD40=\"L\",1,0)+IF(AD42=\"L\",1,0)+IF(AD43=\"L\",1,0)+IF(AD44=\"L\",1,0)+IF(AD45=\"L\",1,0)+IF(AD46=\"L\",1,0)+IF(AD47=\"L\",1,0)","v":0},{"$f":"IF(AD35=\"D\",1,0)+IF(AD36=\"D\",1,0)+IF(AD37=\"D\",1,0)+IF(AD38=\"D\",1,0)+IF(AD39=\"D\",1,0)+IF(AD40=\"D\",1,0)+IF(AD42=\"D\",1,0)+IF(AD43=\"D\",1,0)+IF(AD44=\"D\",1,0)+IF(AD45=\"D\",1,0)+IF(AD46=\"D\",1,0)+IF(AD47=\"D\",1,0)","v":0},{"$f":"IF(AD35=\"W\",1,0)+IF(AD36=\"W\",1,0)+IF(AD37=\"W\",1,0)+IF(AD38=\"W\",1,0)+IF(AD39=\"W\",1,0)+IF(AD40=\"W\",1,0)+IF(AD42=\"W\",1,0)+IF(AD43=\"W\",1,0)+IF(AD44=\"W\",1,0)+IF(AD45=\"W\",1,0)+IF(AD46=\"W\",1,0)+IF(AD47=\"W\",1,0)","v":0},{"$f":"IF(AG35=\"L\",1,0)+IF(AG36=\"L\",1,0)+IF(AG37=\"L\",1,0)+IF(AG38=\"L\",1,0)+IF(AG39=\"L\",1,0)+IF(AG40=\"L\",1,0)+IF(AG42=\"L\",1,0)+IF(AG43=\"L\",1,0)+IF(AG44=\"L\",1,0)+IF(AG45=\"L\",1,0)+IF(AG46=\"L\",1,0)+IF(AG47=\"L\",1,0)","v":0},{"$f":"IF(AG35=\"D\",1,0)+IF(AG36=\"D\",1,0)+IF(AG37=\"D\",1,0)+IF(AG38=\"D\",1,0)+IF(AG39=\"D\",1,0)+IF(AG40=\"D\",1,0)+IF(AG42=\"D\",1,0)+IF(AG43=\"D\",1,0)+IF(AG44=\"D\",1,0)+IF(AG45=\"D\",1,0)+IF(AG46=\"D\",1,0)+IF(AG47=\"D\",1,0)","v":0},{"$f":"IF(AG35=\"W\",1,0)+IF(AG36=\"W\",1,0)+IF(AG37=\"W\",1,0)+IF(AG38=\"W\",1,0)+IF(AG39=\"W\",1,0)+IF(AG40=\"W\",1,0)+IF(AG42=\"W\",1,0)+IF(AG43=\"W\",1,0)+IF(AG44=\"W\",1,0)+IF(AG45=\"W\",1,0)+IF(AG46=\"W\",1,0)+IF(AG47=\"W\",1,0)","v":0},{"$f":"IF(AJ35=\"L\",1,0)+IF(AJ36=\"L\",1,0)+IF(AJ37=\"L\",1,0)+IF(AJ38=\"L\",1,0)+IF(AJ39=\"L\",1,0)+IF(AJ40=\"L\",1,0)+IF(AJ42=\"L\",1,0)+IF(AJ43=\"L\",1,0)+IF(AJ44=\"L\",1,0)+IF(AJ45=\"L\",1,0)+IF(AJ46=\"L\",1,0)+IF(AJ47=\"L\",1,0)","v":0},{"$f":"IF(AJ35=\"D\",1,0)+IF(AJ36=\"D\",1,0)+IF(AJ37=\"D\",1,0)+IF(AJ38=\"D\",1,0)+IF(AJ39=\"D\",1,0)+IF(AJ40=\"D\",1,0)+IF(AJ42=\"D\",1,0)+IF(AJ43=\"D\",1,0)+IF(AJ44=\"D\",1,0)+IF(AJ45=\"D\",1,0)+IF(AJ46=\"D\",1,0)+IF(AJ47=\"D\",1,0)","v":0},{"$f":"IF(AJ35=\"W\",1,0)+IF(AJ36=\"W\",1,0)+IF(AJ37=\"W\",1,0)+IF(AJ38=\"W\",1,0)+IF(AJ39=\"W\",1,0)+IF(AJ40=\"W\",1,0)+IF(AJ42=\"W\",1,0)+IF(AJ43=\"W\",1,0)+IF(AJ44=\"W\",1,0)+IF(AJ45=\"W\",1,0)+IF(AJ46=\"W\",1,0)+IF(AJ47=\"W\",1,0)","v":0},{"$f":"IF(AM35=\"L\",1,0)+IF(AM36=\"L\",1,0)+IF(AM37=\"L\",1,0)+IF(AM38=\"L\",1,0)+IF(AM39=\"L\",1,0)+IF(AM40=\"L\",1,0)+IF(AM42=\"L\",1,0)+IF(AM43=\"L\",1,0)+IF(AM44=\"L\",1,0)+IF(AM45=\"L\",1,0)+IF(AM46=\"L\",1,0)+IF(AM47=\"L\",1,0)","v":0},{"$f":"IF(AM35=\"D\",1,0)+IF(AM36=\"D\",1,0)+IF(AM37=\"D\",1,0)+IF(AM38=\"D\",1,0)+IF(AM39=\"D\",1,0)+IF(AM40=\"D\",1,0)+IF(AM42=\"D\",1,0)+IF(AM43=\"D\",1,0)+IF(AM44=\"D\",1,0)+IF(AM45=\"D\",1,0)+IF(AM46=\"D\",1,0)+IF(AM47=\"D\",1,0)","v":0},{"$f":"IF(AM35=\"W\",1,0)+IF(AM36=\"W\",1,0)+IF(AM37=\"W\",1,0)+IF(AM38=\"W\",1,0)+IF(AM39=\"W\",1,0)+IF(AM40=\"W\",1,0)+IF(AM42=\"W\",1,0)+IF(AM43=\"W\",1,0)+IF(AM44=\"W\",1,0)+IF(AM45=\"W\",1,0)+IF(AM46=\"W\",1,0)+IF(AM47=\"W\",1,0)","v":0},{"$f":"IF(AP35=\"L\",1,0)+IF(AP36=\"L\",1,0)+IF(AP37=\"L\",1,0)+IF(AP38=\"L\",1,0)+IF(AP39=\"L\",1,0)+IF(AP40=\"L\",1,0)+IF(AP42=\"L\",1,0)+IF(AP43=\"L\",1,0)+IF(AP44=\"L\",1,0)+IF(AP45=\"L\",1,0)+IF(AP46=\"L\",1,0)+IF(AP47=\"L\",1,0)","v":0},{"$f":"IF(AP35=\"D\",1,0)+IF(AP36=\"D\",1,0)+IF(AP37=\"D\",1,0)+IF(AP38=\"D\",1,0)+IF(AP39=\"D\",1,0)+IF(AP40=\"D\",1,0)+IF(AP42=\"D\",1,0)+IF(AP43=\"D\",1,0)+IF(AP44=\"D\",1,0)+IF(AP45=\"D\",1,0)+IF(AP46=\"D\",1,0)+IF(AP47=\"D\",1,0)","v":0},{"$f":"IF(AP35=\"W\",1,0)+IF(AP36=\"W\",1,0)+IF(AP37=\"W\",1,0)+IF(AP38=\"W\",1,0)+IF(AP39=\"W\",1,0)+IF(AP40=\"W\",1,0)+IF(AP42=\"W\",1,0)+IF(AP43=\"W\",1,0)+IF(AP44=\"W\",1,0)+IF(AP45=\"W\",1,0)+IF(AP46=\"W\",1,0)+IF(AP47=\"W\",1,0)","v":0}]
[null,"F/A",null,{"$f":"IF(F36=\"L\",1,0)+IF(F37=\"L\",1,0)+IF(F38=\"L\",1,0)+IF(F39=\"L\",1,0)+IF(F40=\"L\",1,0)+IF(F41=\"L\",1,0)+IF(F42=\"L\",1,0)+IF(F43=\"L\",1,0)+IF(F44=\"L\",1,0)+IF(F45=\"L\",1,0)+IF(F46=\"L\",1,0)+IF(F47=\"L\",1,0)+IF(F48=\"L\",1,0)","v":0},{"$f":"IF(F36=\"D\",1,0)+IF(F37=\"D\",1,0)+IF(F38=\"D\",1,0)+IF(F39=\"D\",1,0)+IF(F40=\"D\",1,0)+IF(F41=\"D\",1,0)+IF(F42=\"D\",1,0)+IF(F43=\"D\",1,0)+IF(F44=\"D\",1,0)+IF(F45=\"D\",1,0)+IF(F46=\"D\",1,0)+IF(F47=\"D\",1,0)+IF(F48=\"D\",1,0)","v":0},{"$f":"IF(F36=\"W\",1,0)+IF(F37=\"W\",1,0)+IF(F38=\"W\",1,0)+IF(F39=\"W\",1,0)+IF(F40=\"W\",1,0)+IF(F41=\"W\",1,0)+IF(F42=\"W\",1,0)+IF(F43=\"W\",1,0)+IF(F44=\"W\",1,0)+IF(F45=\"W\",1,0)+IF(F46=\"W\",1,0)+IF(F47=\"W\",1,0)+IF(F48=\"W\",1,0)","v":0},{"$f":"IF(I36=\"L\",1,0)+IF(I37=\"L\",1,0)+IF(I38=\"L\",1,0)+IF(I39=\"L\",1,0)+IF(I40=\"L\",1,0)+IF(I41=\"L\",1,0)+IF(I42=\"L\",1,0)+IF(I43=\"L\",1,0)+IF(I44=\"L\",1,0)+IF(I45=\"L\",1,0)+IF(I46=\"L\",1,0)+IF(I47=\"L\",1,0)+IF(I48=\"L\",1,0)","v":0},{"$f":"IF(I36=\"D\",1,0)+IF(I37=\"D\",1,0)+IF(I38=\"D\",1,0)+IF(I39=\"D\",1,0)+IF(I40=\"D\",1,0)+IF(I41=\"D\",1,0)+IF(I42=\"D\",1,0)+IF(I43=\"D\",1,0)+IF(I44=\"D\",1,0)+IF(I45=\"D\",1,0)+IF(I46=\"D\",1,0)+IF(I47=\"D\",1,0)+IF(I48=\"D\",1,0)","v":0},{"$f":"IF(I36=\"W\",1,0)+IF(I37=\"W\",1,0)+IF(I38=\"W\",1,0)+IF(I39=\"W\",1,0)+IF(I40=\"W\",1,0)+IF(I41=\"W\",1,0)+IF(I42=\"W\",1,0)+IF(I43=\"W\",1,0)+IF(I44=\"W\",1,0)+IF(I45=\"W\",1,0)+IF(I46=\"W\",1,0)+IF(I47=\"W\",1,0)+IF(I48=\"W\",1,0)","v":0},{"$f":"IF(L36=\"L\",1,0)+IF(L37=\"L\",1,0)+IF(L38=\"L\",1,0)+IF(L39=\"L\",1,0)+IF(L40=\"L\",1,0)+IF(L41=\"L\",1,0)+IF(L42=\"L\",1,0)+IF(L43=\"L\",1,0)+IF(L44=\"L\",1,0)+IF(L45=\"L\",1,0)+IF(L46=\"L\",1,0)+IF(L47=\"L\",1,0)+IF(L48=\"L\",1,0)","v":0},{"$f":"IF(L36=\"D\",1,0)+IF(L37=\"D\",1,0)+IF(L38=\"D\",1,0)+IF(L39=\"D\",1,0)+IF(L40=\"D\",1,0)+IF(L41=\"D\",1,0)+IF(L42=\"D\",1,0)+IF(L43=\"D\",1,0)+IF(L44=\"D\",1,0)+IF(L45=\"D\",1,0)+IF(L46=\"D\",1,0)+IF(L47=\"D\",1,0)+IF(L48=\"D\",1,0)","v":0},{"$f":"IF(L36=\"W\",1,0)+IF(L37=\"W\",1,0)+IF(L38=\"W\",1,0)+IF(L39=\"W\",1,0)+IF(L40=\"W\",1,0)+IF(L41=\"W\",1,0)+IF(L42=\"W\",1,0)+IF(L43=\"W\",1,0)+IF(L44=\"W\",1,0)+IF(L45=\"W\",1,0)+IF(L46=\"W\",1,0)+IF(L47=\"W\",1,0)+IF(L48=\"W\",1,0)","v":0},{"$f":"IF(O36=\"L\",1,0)+IF(O37=\"L\",1,0)+IF(O38=\"L\",1,0)+IF(O39=\"L\",1,0)+IF(O40=\"L\",1,0)+IF(O41=\"L\",1,0)+IF(O42=\"L\",1,0)+IF(O43=\"L\",1,0)+IF(O44=\"L\",1,0)+IF(O45=\"L\",1,0)+IF(O46=\"L\",1,0)+IF(O47=\"L\",1,0)+IF(O48=\"L\",1,0)","v":0},{"$f":"IF(O36=\"D\",1,0)+IF(O37=\"D\",1,0)+IF(O38=\"D\",1,0)+IF(O39=\"D\",1,0)+IF(O40=\"D\",1,0)+IF(O41=\"D\",1,0)+IF(O42=\"D\",1,0)+IF(O43=\"D\",1,0)+IF(O44=\"D\",1,0)+IF(O45=\"D\",1,0)+IF(O46=\"D\",1,0)+IF(O47=\"D\",1,0)+IF(O48=\"D\",1,0)","v":0},{"$f":"IF(O36=\"W\",1,0)+IF(O37=\"W\",1,0)+IF(O38=\"W\",1,0)+IF(O39=\"W\",1,0)+IF(O40=\"W\",1,0)+IF(O41=\"W\",1,0)+IF(O42=\"W\",1,0)+IF(O43=\"W\",1,0)+IF(O44=\"W\",1,0)+IF(O45=\"W\",1,0)+IF(O46=\"W\",1,0)+IF(O47=\"W\",1,0)+IF(O48=\"W\",1,0)","v":0},{"$f":"IF(R36=\"L\",1,0)+IF(R37=\"L\",1,0)+IF(R38=\"L\",1,0)+IF(R39=\"L\",1,0)+IF(R40=\"L\",1,0)+IF(R41=\"L\",1,0)+IF(R42=\"L\",1,0)+IF(R43=\"L\",1,0)+IF(R44=\"L\",1,0)+IF(R45=\"L\",1,0)+IF(R46=\"L\",1,0)+IF(R47=\"L\",1,0)+IF(R48=\"L\",1,0)","v":0},{"$f":"IF(R36=\"D\",1,0)+IF(R37=\"D\",1,0)+IF(R38=\"D\",1,0)+IF(R39=\"D\",1,0)+IF(R40=\"D\",1,0)+IF(R41=\"D\",1,0)+IF(R42=\"D\",1,0)+IF(R43=\"D\",1,0)+IF(R44=\"D\",1,0)+IF(R45=\"D\",1,0)+IF(R46=\"D\",1,0)+IF(R47=\"D\",1,0)+IF(R48=\"D\",1,0)","v":0},{"$f":"IF(R36=\"W\",1,0)+IF(R37=\"W\",1,0)+IF(R38=\"W\",1,0)+IF(R39=\"W\",1,0)+IF(R40=\"W\",1,0)+IF(R41=\"W\",1,0)+IF(R42=\"W\",1,0)+IF(R43=\"W\",1,0)+IF(R44=\"W\",1,0)+IF(R45=\"W\",1,0)+IF(R46=\"W\",1,0)+IF(R47=\"W\",1,0)+IF(R48=\"W\",1,0)","v":0},{"$f":"IF(U36=\"L\",1,0)+IF(U37=\"L\",1,0)+IF(U38=\"L\",1,0)+IF(U39=\"L\",1,0)+IF(U40=\"L\",1,0)+IF(U41=\"L\",1,0)+IF(U42=\"L\",1,0)+IF(U43=\"L\",1,0)+IF(U44=\"L\",1,0)+IF(U45=\"L\",1,0)+IF(U46=\"L\",1,0)+IF(U47=\"L\",1,0)+IF(U48=\"L\",1,0)","v":0},{"$f":"IF(U36=\"D\",1,0)+IF(U37=\"D\",1,0)+IF(U38=\"D\",1,0)+IF(U39=\"D\",1,0)+IF(U40=\"D\",1,0)+IF(U41=\"D\",1,0)+IF(U42=\"D\",1,0)+IF(U43=\"D\",1,0)+IF(U44=\"D\",1,0)+IF(U45=\"D\",1,0)+IF(U46=\"D\",1,0)+IF(U47=\"D\",1,0)+IF(U48=\"D\",1,0)","v":0},{"$f":"IF(U36=\"W\",1,0)+IF(U37=\"W\",1,0)+IF(U38=\"W\",1,0)+IF(U39=\"W\",1,0)+IF(U40=\"W\",1,0)+IF(U41=\"W\",1,0)+IF(U42=\"W\",1,0)+IF(U43=\"W\",1,0)+IF(U44=\"W\",1,0)+IF(U45=\"W\",1,0)+IF(U46=\"W\",1,0)+IF(U47=\"W\",1,0)+IF(U48=\"W\",1,0)","v":0},{"$f":"IF(X36=\"L\",1,0)+IF(X37=\"L\",1,0)+IF(X38=\"L\",1,0)+IF(X39=\"L\",1,0)+IF(X40=\"L\",1,0)+IF(X41=\"L\",1,0)+IF(X42=\"L\",1,0)+IF(X43=\"L\",1,0)+IF(X44=\"L\",1,0)+IF(X45=\"L\",1,0)+IF(X46=\"L\",1,0)+IF(X47=\"L\",1,0)+IF(X48=\"L\",1,0)","v":0},{"$f":"IF(X36=\"D\",1,0)+IF(X37=\"D\",1,0)+IF(X38=\"D\",1,0)+IF(X39=\"D\",1,0)+IF(X40=\"D\",1,0)+IF(X41=\"D\",1,0)+IF(X42=\"D\",1,0)+IF(X43=\"D\",1,0)+IF(X44=\"D\",1,0)+IF(X45=\"D\",1,0)+IF(X46=\"D\",1,0)+IF(X47=\"D\",1,0)+IF(X48=\"D\",1,0)","v":0},{"$f":"IF(X36=\"W\",1,0)+IF(X37=\"W\",1,0)+IF(X38=\"W\",1,0)+IF(X39=\"W\",1,0)+IF(X40=\"W\",1,0)+IF(X41=\"W\",1,0)+IF(X42=\"W\",1,0)+IF(X43=\"W\",1,0)+IF(X44=\"W\",1,0)+IF(X45=\"W\",1,0)+IF(X46=\"W\",1,0)+IF(X47=\"W\",1,0)+IF(X48=\"W\",1,0)","v":0},{"$f":"IF(AA36=\"L\",1,0)+IF(AA37=\"L\",1,0)+IF(AA38=\"L\",1,0)+IF(AA39=\"L\",1,0)+IF(AA40=\"L\",1,0)+IF(AA41=\"L\",1,0)+IF(AA42=\"L\",1,0)+IF(AA43=\"L\",1,0)+IF(AA44=\"L\",1,0)+IF(AA45=\"L\",1,0)+IF(AA46=\"L\",1,0)+IF(AA47=\"L\",1,0)+IF(AA48=\"L\",1,0)","v":0},{"$f":"IF(AA36=\"D\",1,0)+IF(AA37=\"D\",1,0)+IF(AA38=\"D\",1,0)+IF(AA39=\"D\",1,0)+IF(AA40=\"D\",1,0)+IF(AA41=\"D\",1,0)+IF(AA42=\"D\",1,0)+IF(AA43=\"D\",1,0)+IF(AA44=\"D\",1,0)+IF(AA45=\"D\",1,0)+IF(AA46=\"D\",1,0)+IF(AA47=\"D\",1,0)+IF(AA48=\"D\",1,0)","v":0},{"$f":"IF(AA36=\"W\",1,0)+IF(AA37=\"W\",1,0)+IF(AA38=\"W\",1,0)+IF(AA39=\"W\",1,0)+IF(AA40=\"W\",1,0)+IF(AA41=\"W\",1,0)+IF(AA42=\"W\",1,0)+IF(AA43=\"W\",1,0)+IF(AA44=\"W\",1,0)+IF(AA45=\"W\",1,0)+IF(AA46=\"W\",1,0)+IF(AA47=\"W\",1,0)+IF(AA48=\"W\",1,0)","v":0},{"$f":"IF(AD36=\"L\",1,0)+IF(AD37=\"L\",1,0)+IF(AD38=\"L\",1,0)+IF(AD39=\"L\",1,0)+IF(AD40=\"L\",1,0)+IF(AD41=\"L\",1,0)+IF(AD42=\"L\",1,0)+IF(AD43=\"L\",1,0)+IF(AD44=\"L\",1,0)+IF(AD45=\"L\",1,0)+IF(AD46=\"L\",1,0)+IF(AD47=\"L\",1,0)+IF(AD48=\"L\",1,0)","v":0},{"$f":"IF(AD36=\"D\",1,0)+IF(AD37=\"D\",1,0)+IF(AD38=\"D\",1,0)+IF(AD39=\"D\",1,0)+IF(AD40=\"D\",1,0)+IF(AD41=\"D\",1,0)+IF(AD42=\"D\",1,0)+IF(AD43=\"D\",1,0)+IF(AD44=\"D\",1,0)+IF(AD45=\"D\",1,0)+IF(AD46=\"D\",1,0)+IF(AD47=\"D\",1,0)+IF(AD48=\"D\",1,0)","v":0},{"$f":"IF(AD36=\"W\",1,0)+IF(AD37=\"W\",1,0)+IF(AD38=\"W\",1,0)+IF(AD39=\"W\",1,0)+IF(AD40=\"W\",1,0)+IF(AD41=\"W\",1,0)+IF(AD42=\"W\",1,0)+IF(AD43=\"W\",1,0)+IF(AD44=\"W\",1,0)+IF(AD45=\"W\",1,0)+IF(AD46=\"W\",1,0)+IF(AD47=\"W\",1,0)+IF(AD48=\"W\",1,0)","v":0},{"$f":"IF(AG36=\"L\",1,0)+IF(AG37=\"L\",1,0)+IF(AG38=\"L\",1,0)+IF(AG39=\"L\",1,0)+IF(AG40=\"L\",1,0)+IF(AG41=\"L\",1,0)+IF(AG42=\"L\",1,0)+IF(AG43=\"L\",1,0)+IF(AG44=\"L\",1,0)+IF(AG45=\"L\",1,0)+IF(AG46=\"L\",1,0)+IF(AG47=\"L\",1,0)+IF(AG48=\"L\",1,0)","v":0},{"$f":"IF(AG36=\"D\",1,0)+IF(AG37=\"D\",1,0)+IF(AG38=\"D\",1,0)+IF(AG39=\"D\",1,0)+IF(AG40=\"D\",1,0)+IF(AG41=\"D\",1,0)+IF(AG42=\"D\",1,0)+IF(AG43=\"D\",1,0)+IF(AG44=\"D\",1,0)+IF(AG45=\"D\",1,0)+IF(AG46=\"D\",1,0)+IF(AG47=\"D\",1,0)+IF(AG48=\"D\",1,0)","v":0},{"$f":"IF(AG36=\"W\",1,0)+IF(AG37=\"W\",1,0)+IF(AG38=\"W\",1,0)+IF(AG39=\"W\",1,0)+IF(AG40=\"W\",1,0)+IF(AG41=\"W\",1,0)+IF(AG42=\"W\",1,0)+IF(AG43=\"W\",1,0)+IF(AG44=\"W\",1,0)+IF(AG45=\"W\",1,0)+IF(AG46=\"W\",1,0)+IF(AG47=\"W\",1,0)+IF(AG48=\"W\",1,0)","v":0},{"$f":"IF(AJ36=\"L\",1,0)+IF(AJ37=\"L\",1,0)+IF(AJ38=\"L\",1,0)+IF(AJ39=\"L\",1,0)+IF(AJ40=\"L\",1,0)+IF(AJ41=\"L\",1,0)+IF(AJ42=\"L\",1,0)+IF(AJ43=\"L\",1,0)+IF(AJ44=\"L\",1,0)+IF(AJ45=\"L\",1,0)+IF(AJ46=\"L\",1,0)+IF(AJ47=\"L\",1,0)+IF(AJ48=\"L\",1,0)","v":0},{"$f":"IF(AJ36=\"D\",1,0)+IF(AJ37=\"D\",1,0)+IF(AJ38=\"D\",1,0)+IF(AJ39=\"D\",1,0)+IF(AJ40=\"D\",1,0)+IF(AJ41=\"D\",1,0)+IF(AJ42=\"D\",1,0)+IF(AJ43=\"D\",1,0)+IF(AJ44=\"D\",1,0)+IF(AJ45=\"D\",1,0)+IF(AJ46=\"D\",1,0)+IF(AJ47=\"D\",1,0)+IF(AJ48=\"D\",1,0)","v":0},{"$f":"IF(AJ36=\"W\",1,0)+IF(AJ37=\"W\",1,0)+IF(AJ38=\"W\",1,0)+IF(AJ39=\"W\",1,0)+IF(AJ40=\"W\",1,0)+IF(AJ41=\"W\",1,0)+IF(AJ42=\"W\",1,0)+IF(AJ43=\"W\",1,0)+IF(AJ44=\"W\",1,0)+IF(AJ45=\"W\",1,0)+IF(AJ46=\"W\",1,0)+IF(AJ47=\"W\",1,0)+IF(AJ48=\"W\",1,0)","v":0},{"$f":"IF(AM36=\"L\",1,0)+IF(AM37=\"L\",1,0)+IF(AM38=\"L\",1,0)+IF(AM39=\"L\",1,0)+IF(AM40=\"L\",1,0)+IF(AM41=\"L\",1,0)+IF(AM42=\"L\",1,0)+IF(AM43=\"L\",1,0)+IF(AM44=\"L\",1,0)+IF(AM45=\"L\",1,0)+IF(AM46=\"L\",1,0)+IF(AM47=\"L\",1,0)+IF(AM48=\"L\",1,0)","v":0},{"$f":"IF(AM36=\"D\",1,0)+IF(AM37=\"D\",1,0)+IF(AM38=\"D\",1,0)+IF(AM39=\"D\",1,0)+IF(AM40=\"D\",1,0)+IF(AM41=\"D\",1,0)+IF(AM42=\"D\",1,0)+IF(AM43=\"D\",1,0)+IF(AM44=\"D\",1,0)+IF(AM45=\"D\",1,0)+IF(AM46=\"D\",1,0)+IF(AM47=\"D\",1,0)+IF(AM48=\"D\",1,0)","v":0},{"$f":"IF(AM36=\"W\",1,0)+IF(AM37=\"W\",1,0)+IF(AM38=\"W\",1,0)+IF(AM39=\"W\",1,0)+IF(AM40=\"W\",1,0)+IF(AM41=\"W\",1,0)+IF(AM42=\"W\",1,0)+IF(AM43=\"W\",1,0)+IF(AM44=\"W\",1,0)+IF(AM45=\"W\",1,0)+IF(AM46=\"W\",1,0)+IF(AM47=\"W\",1,0)+IF(AM48=\"W\",1,0)","v":0},{"$f":"IF(AP36=\"L\",1,0)+IF(AP37=\"L\",1,0)+IF(AP38=\"L\",1,0)+IF(AP39=\"L\",1,0)+IF(AP40=\"L\",1,0)+IF(AP41=\"L\",1,0)+IF(AP42=\"L\",1,0)+IF(AP43=\"L\",1,0)+IF(AP44=\"L\",1,0)+IF(AP45=\"L\",1,0)+IF(AP46=\"L\",1,0)+IF(AP47=\"L\",1,0)+IF(AP48=\"L\",1,0)","v":0},{"$f":"IF(AP36=\"D\",1,0)+IF(AP37=\"D\",1,0)+IF(AP38=\"D\",1,0)+IF(AP39=\"D\",1,0)+IF(AP40=\"D\",1,0)+IF(AP41=\"D\",1,0)+IF(AP42=\"D\",1,0)+IF(AP43=\"D\",1,0)+IF(AP44=\"D\",1,0)+IF(AP45=\"D\",1,0)+IF(AP46=\"D\",1,0)+IF(AP47=\"D\",1,0)+IF(AP48=\"D\",1,0)","v":0},{"$f":"IF(AP36=\"W\",1,0)+IF(AP37=\"W\",1,0)+IF(AP38=\"W\",1,0)+IF(AP39=\"W\",1,0)+IF(AP40=\"W\",1,0)+IF(AP41=\"W\",1,0)+IF(AP42=\"W\",1,0)+IF(AP43=\"W\",1,0)+IF(AP44=\"W\",1,0)+IF(AP45=\"W\",1,0)+IF(AP46=\"W\",1,0)+IF(AP47=\"W\",1,0)+IF(AP48=\"W\",1,0)","v":0},null,null,null,null,null,null,null,null,null,null,null,null,null,null,null,null,null,null,null,{"$f":"SUM(BJ35:BJ46)","v":0}]
[null,null,null,null,{"$f":"SUM(E36)+SUM(E37)+SUM(E38)+SUM(E39)+SUM(E40)+SUM(E41)+SUM(E42)+SUM(E43)+SUM(E44)+SUM(E45)+SUM(E46)+SUM(E47)+SUM(E48)","v":0},{"$f":"SUM(D36)+SUM(D37)+SUM(D38)+SUM(D39)+SUM(D40)+SUM(D41)+SUM(D42)+SUM(D43)+SUM(D44)+SUM(D45)+SUM(D46)+SUM(D47)+SUM(D48)","v":0},null,{"$f":"SUM(H36)+SUM(H37)+SUM(H38)+SUM(H39)+SUM(H40)+SUM(H41)+SUM(H42)+SUM(H43)+SUM(H44)+SUM(H45)+SUM(H46)+SUM(H47)+SUM(H48)","v":0},{"$f":"SUM(G36)+SUM(G37)+SUM(G38)+SUM(G39)+SUM(G40)+SUM(G41)+SUM(G42)+SUM(G43)+SUM(G44)+SUM(G45)+SUM(G46)+SUM(G47)+SUM(G48)","v":0},null,{"$f":"SUM(K36)+SUM(K37)+SUM(K38)+SUM(K39)+SUM(K40)+SUM(K41)+SUM(K42)+SUM(K43)+SUM(K44)+SUM(K45)+SUM(K46)+SUM(K47)+SUM(K48)","v":0},{"$f":"SUM(J36)+SUM(J37)+SUM(J38)+SUM(J39)+SUM(J40)+SUM(J41)+SUM(J42)+SUM(J43)+SUM(J44)+SUM(J45)+SUM(J46)+SUM(J47)+SUM(J48)","v":0},null,{"$f":"SUM(N36)+SUM(N37)+SUM(N38)+SUM(N39)+SUM(N40)+SUM(N41)+SUM(N42)+SUM(N43)+SUM(N44)+SUM(N45)+SUM(N46)+SUM(N47)+SUM(N48)","v":0},{"$f":"SUM(M36)+SUM(M37)+SUM(M38)+SUM(M39)+SUM(M40)+SUM(M41)+SUM(M42)+SUM(M43)+SUM(M44)+SUM(M45)+SUM(M46)+SUM(M47)+SUM(M48)","v":0},null,{"$f":"SUM(Q36)+SUM(Q37)+SUM(Q38)+SUM(Q39)+SUM(Q40)+SUM(Q41)+SUM(Q42)+SUM(Q43)+SUM(Q44)+SUM(Q45)+SUM(Q46)+SUM(Q47)+SUM(Q48)","v":0},{"$f":"SUM(P36)+SUM(P37)+SUM(P38)+SUM(P39)+SUM(P40)+SUM(P41)+SUM(P42)+SUM(P43)+SUM(P44)+SUM(P45)+SUM(P46)+SUM(P47)+SUM(P48)","v":0},null,{"$f":"SUM(T36)+SUM(T37)+SUM(T38)+SUM(T39)+SUM(T40)+SUM(T41)+SUM(T42)+SUM(T43)+SUM(T44)+SUM(T45)+SUM(T46)+SUM(T47)+SUM(T48)","v":0},{"$f":"SUM(S36)+SUM(S37)+SUM(S38)+SUM(S39)+SUM(S40)+SUM(S41)+SUM(S42)+SUM(S43)+SUM(S44)+SUM(S45)+SUM(S46)+SUM(S47)+SUM(S48)","v":0},null,{"$f":"SUM(W36)+SUM(W37)+SUM(W38)+SUM(W39)+SUM(W40)+SUM(W41)+SUM(W42)+SUM(W43)+SUM(W44)+SUM(W45)+SUM(W46)+SUM(W47)+SUM(W48)","v":0},{"$f":"SUM(V36)+SUM(V37)+SUM(V38)+SUM(V39)+SUM(V40)+SUM(V41)+SUM(V42)+SUM(V43)+SUM(V44)+SUM(V45)+SUM(V46)+SUM(V47)+SUM(V48)","v":0},null,{"$f":"SUM(Z36)+SUM(Z37)+SUM(Z38)+SUM(Z39)+SUM(Z40)+SUM(Z41)+SUM(Z42)+SUM(Z43)+SUM(Z44)+SUM(Z45)+SUM(Z46)+SUM(Z47)+SUM(Z48)","v":0},{"$f":"SUM(Y36)+SUM(Y37)+SUM(Y38)+SUM(Y39)+SUM(Y40)+SUM(Y41)+SUM(Y42)+SUM(Y43)+SUM(Y44)+SUM(Y45)+SUM(Y46)+SUM(Y47)+SUM(Y48)","v":0},null,{"$f":"SUM(AC36)+SUM(AC37)+SUM(AC38)+SUM(AC39)+SUM(AC40)+SUM(AC41)+SUM(AC42)+SUM(AC43)+SUM(AC44)+SUM(AC45)+SUM(AC46)+SUM(AC47)+SUM(AC48)","v":0},{"$f":"SUM(AB36)+SUM(AB37)+SUM(AB38)+SUM(AB39)+SUM(AB40)+SUM(AB41)+SUM(AB42)+SUM(AB43)+SUM(AB44)+SUM(AB45)+SUM(AB46)+SUM(AB47)+SUM(AB48)","v":0},null,{"$f":"SUM(AF36)+SUM(AF37)+SUM(AF38)+SUM(AF39)+SUM(AF40)+SUM(AF41)+SUM(AF42)+SUM(AF43)+SUM(AF44)+SUM(AF45)+SUM(AF46)+SUM(AF47)+SUM(AF48)","v":0},{"$f":"SUM(AE36)+SUM(AE37)+SUM(AE38)+SUM(AE39)+SUM(AE40)+SUM(AE41)+SUM(AE42)+SUM(AE43)+SUM(AE44)+SUM(AE45)+SUM(AE46)+SUM(AE47)+SUM(AE48)","v":0},null,{"$f":"SUM(AI36)+SUM(AI37)+SUM(AI38)+SUM(AI39)+SUM(AI40)+SUM(AI41)+SUM(AI42)+SUM(AI43)+SUM(AI44)+SUM(AI45)+SUM(AI46)+SUM(AI47)+SUM(AI48)","v":0},{"$f":"SUM(AH36)+SUM(AH37)+SUM(AH38)+SUM(AH39)+SUM(AH40)+SUM(AH41)+SUM(AH42)+SUM(AH43)+SUM(AH44)+SUM(AH45)+SUM(AH46)+SUM(AH47)+SUM(AH48)","v":0},null,{"$f":"SUM(AL36)+SUM(AL37)+SUM(AL38)+SUM(AL39)+SUM(AL40)+SUM(AL41)+SUM(AL42)+SUM(AL43)+SUM(AL44)+SUM(AL45)+SUM(AL46)+SUM(AL47)+SUM(AL48)","v":0},{"$f":"SUM(AK36)+SUM(AK37)+SUM(AK38)+SUM(AK39)+SUM(AK40)+SUM(AK41)+SUM(AK42)+SUM(AK43)+SUM(AK44)+SUM(AK45)+SUM(AK46)+SUM(AK47)+SUM(AK48)","v":0},null,{"$f":"SUM(AO36)+SUM(AO37)+SUM(AO38)+SUM(AO39)+SUM(AO40)+SUM(AO41)+SUM(AO42)+SUM(AO43)+SUM(AO44)+SUM(AO45)+SUM(AO46)+SUM(AO47)+SUM(AO48)","v":0},{"$f":"SUM(AN36)+SUM(AN37)+SUM(AN38)+SUM(AN39)+SUM(AN40)+SUM(AN41)+SUM(AN42)+SUM(AN43)+SUM(AN44)+SUM(AN45)+SUM(AN46)+SUM(AN47)+SUM(AN48)","v":0}]
[null,null,null,null,null,null,null,null,null,null,null,null,null,null,null,null,null,null,null,null,null,null,null,null,null,null,null,null,null,null,null,null,null,null,null,null,null,null,null,null,null,null,null,null,null,null,"Home",null,null,null,null,null,null,null,null,"Away"]
[null,null,null,null,null,null,null,null,null,null,null,null,null,null,null,null,null,null,null,null,null,null,null,null,null,null,null,null,null,null,null,null,null,null,null,null,null,null,null,null,null,null,null,"P","W","D","L","F","A","GD","Pts",null,"P","W","D","L","F","A","GD","Pts",null,"P","W","D","L","F","A","GD","Pts"]
[null,null,{"$f":"C3","v":"Central Coast Mariners"},null,null,{"$f":"IF(D53=\"\",\"\",IF(E53=\"\",\"\",IF(D53>E53,\"W\",IF(D53=E53,\"D\",IF(D53<E53,\"L\")))))","v":""},null,null,{"$f":"IF(G53=\"\",\"\",IF(H53=\"\",\"\",IF(G53>H53,\"W\",IF(G53=H53,\"D\",IF(G53<H53,\"L\")))))","v":""},null,null,{"$f":"IF(J53=\"\",\"\",IF(K53=\"\",\"\",IF(J53>K53,\"W\",IF(J53=K53,\"D\",IF(J53<K53,\"L\")))))","v":""},null,null,{"$f":"IF(M53=\"\",\"\",IF(N53=\"\",\"\",IF(M53>N53,\"W\",IF(M53=N53,\"D\",IF(M53<N53,\"L\")))))","v":""},null,null,{"$f":"IF(P53=\"\",\"\",IF(Q53=\"\",\"\",IF(P53>Q53,\"W\",IF(P53=Q53,\"D\",IF(P53<Q53,\"L\")))))","v":""},null,null,{"$f":"IF(S53=\"\",\"\",IF(T53=\"\",\"\",IF(S53>T53,\"W\",IF(S53=T53,\"D\",IF(S53<T53,\"L\")))))","v":""},null,null,{"$f":"IF(V53=\"\",\"\",IF(W53=\"\",\"\",IF(V53>W53,\"W\",IF(V53=W53,\"D\",IF(V53<W53,\"L\")))))","v":""},null,null,{"$f":"IF(Y53=\"\",\"\",IF(Z53=\"\",\"\",IF(Y53>Z53,\"W\",IF(Y53=Z53,\"D\",IF(Y53<Z53,\"L\")))))","v":""},null,null,{"$f":"IF(AB53=\"\",\"\",IF(AC53=\"\",\"\",IF(AB53>AC53,\"W\",IF(AB53=AC53,\"D\",IF(AB53<AC53,\"L\")))))","v":""},null,null,{"$f":"IF(AE53=\"\",\"\",IF(AF53=\"\",\"\",IF(AE53>AF53,\"W\",IF(AE53=AF53,\"D\",IF(AE53<AF53,\"L\")))))","v":""},null,null,{"$f":"IF(AH53=\"\",\"\",IF(AI53=\"\",\"\",IF(AH53>AI53,\"W\",IF(AH53=AI53,\"D\",IF(AH53<AI53,\"L\")))))","v":""},null,null,{"$f":"IF(AK53=\"\",\"\",IF(AL53=\"\",\"\",IF(AK53>AL53,\"W\",IF(AK53=AL53,\"D\",IF(AK53<AL53,\"L\")))))","v":""},null,null,{"$f":"IF(AN53=\"\",\"\",IF(AO53=\"\",\"\",IF(AN53>AO53,\"W\",IF(AN53=AO53,\"D\",IF(AN53<AO53,\"L\")))))","v":""},{"$f":"C53","v":"Central Coast Mariners"},{"$f":"AR3+AR19+AR35","v":1},{"$f":"AS3+AS19+AS35","v":0},1,0,0,0,0,1,null,{"$f":"BA3+BA19+BA35","v":0},{"$f":"BB3+BB19+BB35","v":0},0,0,0,0,0,0,null,{"$f":"BJ3+BJ19+BJ35","v":1},{"$f":"BK3+BK19+BK35","v":0},1,0,0,0,0,1]
[null,null,"Auckland FC",null,null,"",null,null,"",null,null,"",null,null,"",null,null,"",null,null,"",null,null,{"$f":"IF(V54=\"\",\"\",IF(W54=\"\",\"\",IF(V54>W54,\"W\",IF(V54=W54,\"D\",IF(V54<W54,\"L\")))))","v":""},null,null,"",null,null,"",null,null,"",null,null,"",null,null,"",null,null,"",{"$f":"C54","v":"Auckland FC"},{"$f":"AR4+AR20+AR36","v":1},1,0,0,2,0,2,3,null,{"$f":"BA4+BA20+BA36","v":0},0,0,0,0,0,0,0,null,{"$f":"BJ4+BJ20+BJ36","v":1},1,0,0,2,0,2,3]
[null,null,"Newcastle Jets",null,null,"",null,null,"",null,null,"",null,null,"",null,null,"",null,null,"",null,null,"",null,null,"",null,null,"",null,null,"",null,null,"",null,null,"",null,null,"","Newcastle Jets",1,0,0,1,0,1,-1,0,null,{"$f":"BA5+BA21+BA37","v":0},0,0,0,0,0,0,0,null,{"$f":"BJ5+BJ21+BJ37","v":1},0,0,1,0,1,-1,0]
[null,null,"Western Sydney Wanderers FC",null,null,"",null,null,"",null,null,"",null,null,"",null,null,"",null,null,"",null,null,"",null,null,"",null,null,"",null,null,"",null,null,"",null,null,"",null,null,"","Western Sydney Wanderers FC",1,0,0,1,1,2,-1,0,null,{"$f":"BA6+BA22+BA38","v":0},0,0,0,0,0,0,0,null,{"$f":"BJ6+BJ22+BJ38","v":1},0,0,1,1,2,-1,0]
[null,null,"Wellington Phoenix",null,null,"",null,null,"",null,null,"",null,null,"",null,null,"",null,null,"",null,null,"",null,null,"",null,null,"",null,null,"",null,null,"",null,null,"",null,null,"","Wellington Phoenix",1,0,1,0,1,1,0,1,null,{"$f":"BA7+BA23+BA39","v":0},0,0,0,0,0,0,0,null,{"$f":"BJ7+BJ23+BJ39","v":1},0,1,0,1,1,0,1]
[null,null,"Macarthur FC",null,null,"",null,null,"",null,null,"",null,null,"",null,null,"",null,null,"",null,null,"",null,null,"",null,null,"",null,null,"",null,null,"",null,null,"",null,null,"","Macarthur FC",1,1,0,0,6,1,5,3,null,{"$f":"BA8+BA24+BA40","v":0},0,0,0,0,0,0,0,null,{"$f":"BJ8+BJ24+BJ40","v":1},1,0,0,6,1,5,3]
[null,null,"Adelaide United",null,null,null,null,null,null,null,null,null,null,null,null,null,null,null,null,null,null,null,null,null,null,null,null,null,null,null,null,null,null,null,null,null,null,null,null,null,null,null,"Adelaide United",0,0,0,0,0,0,0,0,null,{"$f":"BA9+BA25+BA41","v":0},0,0,0,0,0,0,0,null,{"$f":"BJ9+BJ25+BJ41","v":0},0,0,0,0,0,0,0]
[null,null,"Melbourne Victory",null,null,"",null,null,"",null,null,"",null,null,"",null,null,"",null,null,"",null,null,{"$f":"IF(V60=\"\",\"\",IF(W60=\"\",\"\",IF(V60>W60,\"W\",IF(V60=W60,\"D\",IF(V60<W60,\"L\")))))","v":""},null,null,"",null,null,"",null,null,"",null,null,"",null,null,"",null,null,"","Melbourne Victory",0,0,0,0,0,0,0,0,null,{"$f":"BA10+BA26+BA42","v":1},0,1,0,0,0,0,1,null,{"$f":"BJ10+BJ26+BJ42","v":1},0,1,0,0,0,0,1]
[null,null,"Brisbane Roar FC",null,null,"",null,null,"",null,null,"",null,null,"",null,null,"",null,null,"",null,null,"",null,null,"",null,null,"",null,null,"",null,null,"",null,null,"",null,null,"","Brisbane Roar FC",0,0,0,0,0,0,0,0,null,{"$f":"BA11+BA27+BA43","v":1},0,0,1,0,2,-2,0,null,{"$f":"BJ11+BJ27+BJ43","v":1},0,0,1,0,2,-2,0]
[null,null,"Melbourne City FC",null,null,"",null,null,"",null,null,"",null,null,"",null,null,"",null,null,"",null,null,"",null,null,"",null,null,"",null,null,"",null,null,"",null,null,"",null,null,"","Melbourne City FC",0,0,0,0,0,0,0,0,null,{"$f":"BA12+BA28+BA44","v":1},1,0,0,1,0,1,3,null,{"$f":"BJ12+BJ28+BJ44","v":1},1,0,0,1,0,1,3]
[null,null,"Sydney FC",null,null,"",null,null,"",null,null,"",null,null,"",null,null,"",null,null,"",null,null,"",null,null,"",null,null,"",null,null,"",null,null,"",null,null,"",null,null,"","Sydney FC",0,0,0,0,0,0,0,0,null,{"$f":"BA13+BA29+BA45","v":1},1,0,0,2,1,1,3,null,{"$f":"BJ13+BJ29+BJ45","v":1},1,0,0,2,1,1,3]
[null,null,"Western United FC",null,null,"",null,null,"",null,null,"",null,null,"",null,null,"",null,null,"",null,null,"",null,null,"",null,null,"",null,null,"",null,null,"",null,null,"",null,null,"","Western United FC",0,0,0,0,0,0,0,0,null,{"$f":"BA14+BA30+BA46","v":1},0,1,0,1,1,0,1,null,{"$f":"BJ14+BJ30+BJ46","v":1},0,1,0,1,1,0,1]
[null,null,"Perth Glory",null,null,"",null,null,"",null,null,"",null,null,"",null,null,"",null,null,"",null,null,"",null,null,"",null,null,"",null,null,"",null,null,"",null,null,"",null,null,"","Perth Glory",0,0,0,0,0,0,0,0,null,{"$f":"BA15+BA31+BA47","v":1},0,0,1,1,6,-5,0,null,{"$f":"BJ15+BJ31+BJ47","v":1},0,0,1,1,6,-5,0]
[null,"W/D/L",null,{"$f":"IF(F53=\"L\",1,0)+IF(F54=\"L\",1,0)+IF(F55=\"L\",1,0)+IF(F56=\"L\",1,0)+IF(F57=\"L\",1,0)+IF(F58=\"L\",1,0)+IF(F60=\"L\",1,0)+IF(F61=\"L\",1,0)+IF(F62=\"L\",1,0)+IF(F63=\"L\",1,0)+IF(F64=\"L\",1,0)+IF(F65=\"L\",1,0)","v":0},{"$f":"IF(F53=\"D\",1,0)+IF(F54=\"D\",1,0)+IF(F55=\"D\",1,0)+IF(F56=\"D\",1,0)+IF(F57=\"D\",1,0)+IF(F58=\"D\",1,0)+IF(F60=\"D\",1,0)+IF(F61=\"D\",1,0)+IF(F62=\"D\",1,0)+IF(F63=\"D\",1,0)+IF(F64=\"D\",1,0)+IF(F65=\"D\",1,0)","v":0},{"$f":"IF(F53=\"W\",1,0)+IF(F54=\"W\",1,0)+IF(F55=\"W\",1,0)+IF(F56=\"W\",1,0)+IF(F57=\"W\",1,0)+IF(F58=\"W\",1,0)+IF(F60=\"W\",1,0)+IF(F61=\"W\",1,0)+IF(F62=\"W\",1,0)+IF(F63=\"W\",1,0)+IF(F64=\"W\",1,0)+IF(F65=\"W\",1,0)","v":0},{"$f":"IF(I53=\"L\",1,0)+IF(I54=\"L\",1,0)+IF(I55=\"L\",1,0)+IF(I56=\"L\",1,0)+IF(I57=\"L\",1,0)+IF(I58=\"L\",1,0)+IF(I60=\"L\",1,0)+IF(I61=\"L\",1,0)+IF(I62=\"L\",1,0)+IF(I63=\"L\",1,0)+IF(I64=\"L\",1,0)+IF(I65=\"L\",1,0)","v":0},{"$f":"IF(I53=\"D\",1,0)+IF(I54=\"D\",1,0)+IF(I55=\"D\",1,0)+IF(I56=\"D\",1,0)+IF(I57=\"D\",1,0)+IF(I58=\"D\",1,0)+IF(I60=\"D\",1,0)+IF(I61=\"D\",1,0)+IF(I62=\"D\",1,0)+IF(I63=\"D\",1,0)+IF(I64=\"D\",1,0)+IF(I65=\"D\",1,0)","v":0},{"$f":"IF(I53=\"W\",1,0)+IF(I54=\"W\",1,0)+IF(I55=\"W\",1,0)+IF(I56=\"W\",1,0)+IF(I57=\"W\",1,0)+IF(I58=\"W\",1,0)+IF(I60=\"W\",1,0)+IF(I61=\"W\",1,0)+IF(I62=\"W\",1,0)+IF(I63=\"W\",1,0)+IF(I64=\"W\",1,0)+IF(I65=\"W\",1,0)","v":0},{"$f":"IF(L53=\"L\",1,0)+IF(L54=\"L\",1,0)+IF(L55=\"L\",1,0)+IF(L56=\"L\",1,0)+IF(L57=\"L\",1,0)+IF(L58=\"L\",1,0)+IF(L60=\"L\",1,0)+IF(L61=\"L\",1,0)+IF(L62=\"L\",1,0)+IF(L63=\"L\",1,0)+IF(L64=\"L\",1,0)+IF(L65=\"L\",1,0)","v":0},{"$f":"IF(L53=\"D\",1,0)+IF(L54=\"D\",1,0)+IF(L55=\"D\",1,0)+IF(L56=\"D\",1,0)+IF(L57=\"D\",1,0)+IF(L58=\"D\",1,0)+IF(L60=\"D\",1,0)+IF(L61=\"D\",1,0)+IF(L62=\"D\",1,0)+IF(L63=\"D\",1,0)+IF(L64=\"D\",1,0)+IF(L65=\"D\",1,0)","v":0},{"$f":"IF(L53=\"W\",1,0)+IF(L54=\"W\",1,0)+IF(L55=\"W\",1,0)+IF(L56=\"W\",1,0)+IF(L57=\"W\",1,0)+IF(L58=\"W\",1,0)+IF(L60=\"W\",1,0)+IF(L61=\"W\",1,0)+IF(L62=\"W\",1,0)+IF(L63=\"W\",1,0)+IF(L64=\"W\",1,0)+IF(L65=\"W\",1,0)","v":0},{"$f":"IF(O53=\"L\",1,0)+IF(O54=\"L\",1,0)+IF(O55=\"L\",1,0)+IF(O56=\"L\",1,0)+IF(O57=\"L\",1,0)+IF(O58=\"L\",1,0)+IF(O60=\"L\",1,0)+IF(O61=\"L\",1,0)+IF(O62=\"L\",1,0)+IF(O63=\"L\",1,0)+IF(O64=\"L\",1,0)+IF(O65=\"L\",1,0)","v":0},{"$f":"IF(O53=\"D\",1,0)+IF(O54=\"D\",1,0)+IF(O55=\"D\",1,0)+IF(O56=\"D\",1,0)+IF(O57=\"D\",1,0)+IF(O58=\"D\",1,0)+IF(O60=\"D\",1,0)+IF(O61=\"D\",1,0)+IF(O62=\"D\",1,0)+IF(O63=\"D\",1,0)+IF(O64=\"D\",1,0)+IF(O65=\"D\",1,0)","v":0},{"$f":"IF(O53=\"W\",1,0)+IF(O54=\"W\",1,0)+IF(O55=\"W\",1,0)+IF(O56=\"W\",1,0)+IF(O57=\"W\",1,0)+IF(O58=\"W\",1,0)+IF(O60=\"W\",1,0)+IF(O61=\"W\",1,0)+IF(O62=\"W\",1,0)+IF(O63=\"W\",1,0)+IF(O64=\"W\",1,0)+IF(O65=\"W\",1,0)","v":0},{"$f":"IF(R53=\"L\",1,0)+IF(R54=\"L\",1,0)+IF(R55=\"L\",1,0)+IF(R56=\"L\",1,0)+IF(R57=\"L\",1,0)+IF(R58=\"L\",1,0)+IF(R60=\"L\",1,0)+IF(R61=\"L\",1,0)+IF(R62=\"L\",1,0)+IF(R63=\"L\",1,0)+IF(R64=\"L\",1,0)+IF(R65=\"L\",1,0)","v":0},{"$f":"IF(R53=\"D\",1,0)+IF(R54=\"D\",1,0)+IF(R55=\"D\",1,0)+IF(R56=\"D\",1,0)+IF(R57=\"D\",1,0)+IF(R58=\"D\",1,0)+IF(R60=\"D\",1,0)+IF(R61=\"D\",1,0)+IF(R62=\"D\",1,0)+IF(R63=\"D\",1,0)+IF(R64=\"D\",1,0)+IF(R65=\"D\",1,0)","v":0},{"$f":"IF(R53=\"W\",1,0)+IF(R54=\"W\",1,0)+IF(R55=\"W\",1,0)+IF(R56=\"W\",1,0)+IF(R57=\"W\",1,0)+IF(R58=\"W\",1,0)+IF(R60=\"W\",1,0)+IF(R61=\"W\",1,0)+IF(R62=\"W\",1,0)+IF(R63=\"W\",1,0)+IF(R64=\"W\",1,0)+IF(R65=\"W\",1,0)","v":0},{"$f":"IF(U53=\"L\",1,0)+IF(U54=\"L\",1,0)+IF(U55=\"L\",1,0)+IF(U56=\"L\",1,0)+IF(U57=\"L\",1,0)+IF(U58=\"L\",1,0)+IF(U60=\"L\",1,0)+IF(U61=\"L\",1,0)+IF(U62=\"L\",1,0)+IF(U63=\"L\",1,0)+IF(U64=\"L\",1,0)+IF(U65=\"L\",1,0)","v":0},{"$f":"IF(U53=\"D\",1,0)+IF(U54=\"D\",1,0)+IF(U55=\"D\",1,0)+IF(U56=\"D\",1,0)+IF(U57=\"D\",1,0)+IF(U58=\"D\",1,0)+IF(U60=\"D\",1,0)+IF(U61=\"D\",1,0)+IF(U62=\"D\",1,0)+IF(U63=\"D\",1,0)+IF(U64=\"D\",1,0)+IF(U65=\"D\",1,0)","v":0},{"$f":"IF(U53=\"W\",1,0)+IF(U54=\"W\",1,0)+IF(U55=\"W\",1,0)+IF(U56=\"W\",1,0)+IF(U57=\"W\",1,0)+IF(U58=\"W\",1,0)+IF(U60=\"W\",1,0)+IF(U61=\"W\",1,0)+IF(U62=\"W\",1,0)+IF(U63=\"W\",1,0)+IF(U64=\"W\",1,0)+IF(U65=\"W\",1,0)","v":0},{"$f":"IF(X53=\"L\",1,0)+IF(X54=\"L\",1,0)+IF(X55=\"L\",1,0)+IF(X56=\"L\",1,0)+IF(X57=\"L\",1,0)+IF(X58=\"L\",1,0)+IF(X60=\"L\",1,0)+IF(X61=\"L\",1,0)+IF(X62=\"L\",1,0)+IF(X63=\"L\",1,0)+IF(X64=\"L\",1,0)+IF(X65=\"L\",1,0)","v":0},{"$f":"IF(X53=\"D\",1,0)+IF(X54=\"D\",1,0)+IF(X55=\"D\",1,0)+IF(X56=\"D\",1,0)+IF(X57=\"D\",1,0)+IF(X58=\"D\",1,0)+IF(X60=\"D\",1,0)+IF(X61=\"D\",1,0)+IF(X62=\"D\",1,0)+IF(X63=\"D\",1,0)+IF(X64=\"D\",1,0)+IF(X65=\"D\",1,0)","v":0},{"$f":"IF(X53=\"W\",1,0)+IF(X54=\"W\",1,0)+IF(X55=\"W\",1,0)+IF(X56=\"W\",1,0)+IF(X57=\"W\",1,0)+IF(X58=\"W\",1,0)+IF(X60=\"W\",1,0)+IF(X61=\"W\",1,0)+IF(X62=\"W\",1,0)+IF(X63=\"W\",1,0)+IF(X64=\"W\",1,0)+IF(X65=\"W\",1,0)","v":0},{"$f":"IF(AA53=\"L\",1,0)+IF(AA54=\"L\",1,0)+IF(AA55=\"L\",1,0)+IF(AA56=\"L\",1,0)+IF(AA57=\"L\",1,0)+IF(AA58=\"L\",1,0)+IF(AA60=\"L\",1,0)+IF(AA61=\"L\",1,0)+IF(AA62=\"L\",1,0)+IF(AA63=\"L\",1,0)+IF(AA64=\"L\",1,0)+IF(AA65=\"L\",1,0)","v":0},{"$f":"IF(AA53=\"D\",1,0)+IF(AA54=\"D\",1,0)+IF(AA55=\"D\",1,0)+IF(AA56=\"D\",1,0)+IF(AA57=\"D\",1,0)+IF(AA58=\"D\",1,0)+IF(AA60=\"D\",1,0)+IF(AA61=\"D\",1,0)+IF(AA62=\"D\",1,0)+IF(AA63=\"D\",1,0)+IF(AA64=\"D\",1,0)+IF(AA65=\"D\",1,0)","v":0},{"$f":"IF(AA53=\"W\",1,0)+IF(AA54=\"W\",1,0)+IF(AA55=\"W\",1,0)+IF(AA56=\"W\",1,0)+IF(AA57=\"W\",1,0)+IF(AA58=\"W\",1,0)+IF(AA60=\"W\",1,0)+IF(AA61=\"W\",1,0)+IF(AA62=\"W\",1,0)+IF(AA63=\"W\",1,0)+IF(AA64=\"W\",1,0)+IF(AA65=\"W\",1,0)","v":0},{"$f":"IF(AD53=\"L\",1,0)+IF(AD54=\"L\",1,0)+IF(AD55=\"L\",1,0)+IF(AD56=\"L\",1,0)+IF(AD57=\"L\",1,0)+IF(AD58=\"L\",1,0)+IF(AD60=\"L\",1,0)+IF(AD61=\"L\",1,0)+IF(AD62=\"L\",1,0)+IF(AD63=\"L\",1,0)+IF(AD64=\"L\",1,0)+IF(AD65=\"L\",1,0)","v":0},{"$f":"IF(AD53=\"D\",1,0)+IF(AD54=\"D\",1,0)+IF(AD55=\"D\",1,0)+IF(AD56=\"D\",1,0)+IF(AD57=\"D\",1,0)+IF(AD58=\"D\",1,0)+IF(AD60=\"D\",1,0)+IF(AD61=\"D\",1,0)+IF(AD62=\"D\",1,0)+IF(AD63=\"D\",1,0)+IF(AD64=\"D\",1,0)+IF(AD65=\"D\",1,0)","v":0},{"$f":"IF(AD53=\"W\",1,0)+IF(AD54=\"W\",1,0)+IF(AD55=\"W\",1,0)+IF(AD56=\"W\",1,0)+IF(AD57=\"W\",1,0)+IF(AD58=\"W\",1,0)+IF(AD60=\"W\",1,0)+IF(AD61=\"W\",1,0)+IF(AD62=\"W\",1,0)+IF(AD63=\"W\",1,0)+IF(AD64=\"W\",1,0)+IF(AD65=\"W\",1,0)","v":0},{"$f":"IF(AG53=\"L\",1,0)+IF(AG54=\"L\",1,0)+IF(AG55=\"L\",1,0)+IF(AG56=\"L\",1,0)+IF(AG57=\"L\",1,0)+IF(AG58=\"L\",1,0)+IF(AG60=\"L\",1,0)+IF(AG61=\"L\",1,0)+IF(AG62=\"L\",1,0)+IF(AG63=\"L\",1,0)+IF(AG64=\"L\",1,0)+IF(AG65=\"L\",1,0)","v":0},{"$f":"IF(AG53=\"D\",1,0)+IF(AG54=\"D\",1,0)+IF(AG55=\"D\",1,0)+IF(AG56=\"D\",1,0)+IF(AG57=\"D\",1,0)+IF(AG58=\"D\",1,0)+IF(AG60=\"D\",1,0)+IF(AG61=\"D\",1,0)+IF(AG62=\"D\",1,0)+IF(AG63=\"D\",1,0)+IF(AG64=\"D\",1,0)+IF(AG65=\"D\",1,0)","v":0},{"$f":"IF(AG53=\"W\",1,0)+IF(AG54=\"W\",1,0)+IF(AG55=\"W\",1,0)+IF(AG56=\"W\",1,0)+IF(AG57=\"W\",1,0)+IF(AG58=\"W\",1,0)+IF(AG60=\"W\",1,0)+IF(AG61=\"W\",1,0)+IF(AG62=\"W\",1,0)+IF(AG63=\"W\",1,0)+IF(AG64=\"W\",1,0)+IF(AG65=\"W\",1,0)","v":0},{"$f":"IF(AJ53=\"L\",1,0)+IF(AJ54=\"L\",1,0)+IF(AJ55=\"L\",1,0)+IF(AJ56=\"L\",1,0)+IF(AJ57=\"L\",1,0)+IF(AJ58=\"L\",1,0)+IF(AJ60=\"L\",1,0)+IF(AJ61=\"L\",1,0)+IF(AJ62=\"L\",1,0)+IF(AJ63=\"L\",1,0)+IF(AJ64=\"L\",1,0)+IF(AJ65=\"L\",1,0)","v":0},{"$f":"IF(AJ53=\"D\",1,0)+IF(AJ54=\"D\",1,0)+IF(AJ55=\"D\",1,0)+IF(AJ56=\"D\",1,0)+IF(AJ57=\"D\",1,0)+IF(AJ58=\"D\",1,0)+IF(AJ60=\"D\",1,0)+IF(AJ61=\"D\",1,0)+IF(AJ62=\"D\",1,0)+IF(AJ63=\"D\",1,0)+IF(AJ64=\"D\",1,0)+IF(AJ65=\"D\",1,0)","v":0},{"$f":"IF(AJ53=\"W\",1,0)+IF(AJ54=\"W\",1,0)+IF(AJ55=\"W\",1,0)+IF(AJ56=\"W\",1,0)+IF(AJ57=\"W\",1,0)+IF(AJ58=\"W\",1,0)+IF(AJ60=\"W\",1,0)+IF(AJ61=\"W\",1,0)+IF(AJ62=\"W\",1,0)+IF(AJ63=\"W\",1,0)+IF(AJ64=\"W\",1,0)+IF(AJ65=\"W\",1,0)","v":0},{"$f":"IF(AM53=\"L\",1,0)+IF(AM54=\"L\",1,0)+IF(AM55=\"L\",1,0)+IF(AM56=\"L\",1,0)+IF(AM57=\"L\",1,0)+IF(AM58=\"L\",1,0)+IF(AM60=\"L\",1,0)+IF(AM61=\"L\",1,0)+IF(AM62=\"L\",1,0)+IF(AM63=\"L\",1,0)+IF(AM64=\"L\",1,0)+IF(AM65=\"L\",1,0)","v":0},{"$f":"IF(AM53=\"D\",1,0)+IF(AM54=\"D\",1,0)+IF(AM55=\"D\",1,0)+IF(AM56=\"D\",1,0)+IF(AM57=\"D\",1,0)+IF(AM58=\"D\",1,0)+IF(AM60=\"D\",1,0)+IF(AM61=\"D\",1,0)+IF(AM62=\"D\",1,0)+IF(AM63=\"D\",1,0)+IF(AM64=\"D\",1,0)+IF(AM65=\"D\",1,0)","v":0},{"$f":"IF(AM53=\"W\",1,0)+IF(AM54=\"W\",1,0)+IF(AM55=\"W\",1,0)+IF(AM56=\"W\",1,0)+IF(AM57=\"W\",1,0)+IF(AM58=\"W\",1,0)+IF(AM60=\"W\",1,0)+IF(AM61=\"W\",1,0)+IF(AM62=\"W\",1,0)+IF(AM63=\"W\",1,0)+IF(AM64=\"W\",1,0)+IF(AM65=\"W\",1,0)","v":0},{"$f":"IF(AP53=\"L\",1,0)+IF(AP54=\"L\",1,0)+IF(AP55=\"L\",1,0)+IF(AP56=\"L\",1,0)+IF(AP57=\"L\",1,0)+IF(AP58=\"L\",1,0)+IF(AP60=\"L\",1,0)+IF(AP61=\"L\",1,0)+IF(AP62=\"L\",1,0)+IF(AP63=\"L\",1,0)+IF(AP64=\"L\",1,0)+IF(AP65=\"L\",1,0)","v":0},{"$f":"IF(AP53=\"D\",1,0)+IF(AP54=\"D\",1,0)+IF(AP55=\"D\",1,0)+IF(AP56=\"D\",1,0)+IF(AP57=\"D\",1,0)+IF(AP58=\"D\",1,0)+IF(AP60=\"D\",1,0)+IF(AP61=\"D\",1,0)+IF(AP62=\"D\",1,0)+IF(AP63=\"D\",1,0)+IF(AP64=\"D\",1,0)+IF(AP65=\"D\",1,0)","v":0},{"$f":"IF(AP53=\"W\",1,0)+IF(AP54=\"W\",1,0)+IF(AP55=\"W\",1,0)+IF(AP56=\"W\",1,0)+IF(AP57=\"W\",1,0)+IF(AP58=\"W\",1,0)+IF(AP60=\"W\",1,0)+IF(AP61=\"W\",1,0)+IF(AP62=\"W\",1,0)+IF(AP63=\"W\",1,0)+IF(AP64=\"W\",1,0)+IF(AP65=\"W\",1,0)","v":0}]
[null,"F/A",null,null,{"$f":"SUM(E53)+SUM(E54)+SUM(E55)+SUM(E56)+SUM(E57)+SUM(E58)+SUM(E60)+SUM(E61)+SUM(E62)+SUM(E65)","v":0},{"$f":"SUM(D53)+SUM(D54)+SUM(D55)+SUM(D56)+SUM(D57)+SUM(D58)+SUM(D60)+SUM(D61)+SUM(D62)+SUM(D65)","v":0},null,{"$f":"SUM(H53)+SUM(H54)+SUM(H55)+SUM(H56)+SUM(H57)+SUM(H58)+SUM(H60)+SUM(H61)+SUM(H62)+SUM(H65)","v":0},{"$f":"SUM(G53)+SUM(G54)+SUM(G55)+SUM(G56)+SUM(G57)+SUM(G58)+SUM(G60)+SUM(G61)+SUM(G62)+SUM(G65)","v":0},null,{"$f":"SUM(K53)+SUM(K54)+SUM(K55)+SUM(K56)+SUM(K57)+SUM(K58)+SUM(K60)+SUM(K61)+SUM(K62)+SUM(K65)","v":0},{"$f":"SUM(J53)+SUM(J54)+SUM(J55)+SUM(J56)+SUM(J57)+SUM(J58)+SUM(J60)+SUM(J61)+SUM(J62)+SUM(J65)","v":0},null,{"$f":"SUM(N53)+SUM(N54)+SUM(N55)+SUM(N56)+SUM(N57)+SUM(N58)+SUM(N60)+SUM(N61)+SUM(N62)+SUM(N65)","v":0},{"$f":"SUM(M53)+SUM(M54)+SUM(M55)+SUM(M56)+SUM(M57)+SUM(M58)+SUM(M60)+SUM(M61)+SUM(M62)+SUM(M65)","v":0},null,{"$f":"SUM(Q53)+SUM(Q54)+SUM(Q55)+SUM(Q56)+SUM(Q57)+SUM(Q58)+SUM(Q60)+SUM(Q61)+SUM(Q62)+SUM(Q65)","v":0},{"$f":"SUM(P53)+SUM(P54)+SUM(P55)+SUM(P56)+SUM(P57)+SUM(P58)+SUM(P60)+SUM(P61)+SUM(P62)+SUM(P65)","v":0},null,{"$f":"SUM(T53)+SUM(T54)+SUM(T55)+SUM(T56)+SUM(T57)+SUM(T58)+SUM(T60)+SUM(T61)+SUM(T62)+SUM(T65)","v":0},{"$f":"SUM(S53)+SUM(S54)+SUM(S55)+SUM(S56)+SUM(S57)+SUM(S58)+SUM(S60)+SUM(S61)+SUM(S62)+SUM(S65)","v":0},null,{"$f":"SUM(W53)+SUM(W54)+SUM(W55)+SUM(W56)+SUM(W57)+SUM(W58)+SUM(W60)+SUM(W61)+SUM(W62)+SUM(W63)+SUM(W64)+SUM(W65)","v":0},{"$f":"SUM(V53)+SUM(V54)+SUM(V55)+SUM(V56)+SUM(V57)+SUM(V58)+SUM(V60)+SUM(V61)+SUM(V62)+SUM(V63)+SUM(V64)+SUM(V65)","v":0},null,{"$f":"SUM(Z53)+SUM(Z54)+SUM(Z55)+SUM(Z56)+SUM(Z57)+SUM(Z58)+SUM(Z60)+SUM(Z61)+SUM(Z62)+SUM(Z65)","v":0},{"$f":"SUM(Y53)+SUM(Y54)+SUM(Y55)+SUM(Y56)+SUM(Y57)+SUM(Y58)+SUM(Y60)+SUM(Y61)+SUM(Y62)+SUM(Y65)","v":0},null,{"$f":"SUM(AC53)+SUM(AC54)+SUM(AC55)+SUM(AC56)+SUM(AC57)+SUM(AC58)+SUM(AC60)+SUM(AC61)+SUM(AC62)+SUM(AC65)","v":0},{"$f":"SUM(AB53)+SUM(AB54)+SUM(AB55)+SUM(AB56)+SUM(AB57)+SUM(AB58)+SUM(AB60)+SUM(AB61)+SUM(AB62)+SUM(AB65)","v":0},null,{"$f":"SUM(AF53)+SUM(AF54)+SUM(AF55)+SUM(AF56)+SUM(AF57)+SUM(AF58)+SUM(AF60)+SUM(AF61)+SUM(AF62)+SUM(AF65)","v":0},{"$f":"SUM(AE53)+SUM(AE54)+SUM(AE55)+SUM(AE56)+SUM(AE57)+SUM(AE58)+SUM(AE60)+SUM(AE61)+SUM(AE62)+SUM(AE65)","v":0},null,{"$f":"SUM(AI53)+SUM(AI54)+SUM(AI55)+SUM(AI56)+SUM(AI57)+SUM(AI58)+SUM(AI60)+SUM(AI61)+SUM(AI62)+SUM(AI65)","v":0},{"$f":"SUM(AH53)+SUM(AH54)+SUM(AH55)+SUM(AH56)+SUM(AH57)+SUM(AH58)+SUM(AH60)+SUM(AH61)+SUM(AH62)+SUM(AH65)","v":0},null,{"$f":"SUM(AL53)+SUM(AL54)+SUM(AL55)+SUM(AL56)+SUM(AL57)+SUM(AL58)+SUM(AL60)+SUM(AL61)+SUM(AL62)+SUM(AL65)","v":0},{"$f":"SUM(AK53)+SUM(AK54)+SUM(AK55)+SUM(AK56)+SUM(AK57)+SUM(AK58)+SUM(AK60)+SUM(AK61)+SUM(AK62)+SUM(AK65)","v":0},null,{"$f":"SUM(AO53)+SUM(AO54)+SUM(AO55)+SUM(AO56)+SUM(AO57)+SUM(AO58)+SUM(AO60)+SUM(AO61)+SUM(AO62)+SUM(AO65)","v":0},{"$f":"SUM(AN53)+SUM(AN54)+SUM(AN55)+SUM(AN56)+SUM(AN57)+SUM(AN58)+SUM(AN60)+SUM(AN61)+SUM(AN62)+SUM(AN65)","v":0},null,{"$f":"SUM(AR53:AR65)","v":6}]
[]
[]
[]
[null,null,{"$f":"C3","v":"Central Coast Mariners"},null,null,null,{"$f":"IF(Fixtures!$K$71=\"\",\"\",Fixtures!$K$71)","v":""},{"$f":"IF(Fixtures!$L$71=\"\",\"\",Fixtures!$L$71)","v":""},null,{"$f":"IF(Fixtures!$K$124=\"\",\"\",Fixtures!$K$124)","v":""},{"$f":"IF(Fixtures!$L$124=\"\",\"\",Fixtures!$L$124)","v":""},null,{"$f":"IF(Fixtures!$K$145=\"\",\"\",Fixtures!$K$145)","v":""},{"$f":"IF(Fixtures!$L$145=\"\",\"\",Fixtures!$L$145)","v":""},null,{"$f":"IF(Fixtures!$K$29=\"\",\"\",Fixtures!$K$29)","v":""},{"$f":"IF(Fixtures!$L$29=\"\",\"\",Fixtures!$L$29)","v":""},null,{"$f":"IF(Fixtures!$K$217=\"\",\"\",Fixtures!$K$217)","v":""},{"$f":"IF(Fixtures!$L$217=\"\",\"\",Fixtures!$L$217)","v":""},null,null,null,null,{"$f":"IF(Fixtures!$K$3=\"\",\"\",Fixtures!$K$3)","v":0},{"$f":"IF(Fixtures!$L$3=\"\",\"\",Fixtures!$L$3)","v":0},null,null,null,null,{"$f":"IF(Fixtures!$K$76=\"\",\"\",Fixtures!$K$76)","v":""},{"$f":"IF(Fixtures!$L$76=\"\",\"\",Fixtures!$L$76)","v":""},null,{"$f":"IF(Fixtures!$K$51=\"\",\"\",Fixtures!$K$51)","v":""},{"$f":"IF(Fixtures!$L$51=\"\",\"\",Fixtures!$L$51)","v":""},null,{"$f":"IF(Fixtures!$K$151=\"\",\"\",Fixtures!$K$151)","v":""},{"$f":"IF(Fixtures!$L$151=\"\",\"\",Fixtures!$L$151)","v":""},null,{"$f":"IF(Fixtures!$K$20=\"\",\"\",Fixtures!$K$20)","v":""},{"$f":"IF(Fixtures!$L$20=\"\",\"\",Fixtures!$L$20)","v":""}]
[null,null,"Auckland FC",{"$f":"IF(Fixtures!$K$169=\"\",\"\",Fixtures!$K$169)","v":""},{"$f":"IF(Fixtures!$L$169=\"\",\"\",Fixtures!$L$169)","v":""},null,null,null,null,{"$f":"IF(Fixtures!$K$40=\"\",\"\",Fixtures!$K$40)","v":""},{"$f":"IF(Fixtures!$L$40=\"\",\"\",Fixtures!$L$40)","v":""},null,{"$f":"IF(Fixtures!$K$180=\"\",\"\",Fixtures!$K$180)","v":""},{"$f":"IF(Fixtures!$L$180=\"\",\"\",Fixtures!$L$180)","v":""},null,{"$f":"IF(Fixtures!$K$144=\"\",\"\",Fixtures!$K$144)","v":""},{"$f":"IF(Fixtures!$L$144=\"\",\"\",Fixtures!$L$144)","v":""},null,{"$f":"IF(Fixtures!$K$122=\"\",\"\",Fixtures!$K$122)","v":""},{"$f":"IF(Fixtures!$L$122=\"\",\"\",Fixtures!$L$122)","v":""},null,null,null,null,{"$f":"IF(Fixtures!$K$77=\"\",\"\",Fixtures!$K$77)","v":""},{"$f":"IF(Fixtures!$L$77=\"\",\"\",Fixtures!$L$77)","v":""},null,{"$f":"IF(Fixtures!$K$4=\"\",\"\",Fixtures!$K$4)","v":2},{"$f":"IF(Fixtures!$L$4=\"\",\"\",Fixtures!$L$4)","v":0},null,{"$f":"IF(Fixtures!$K$107=\"\",\"\",Fixtures!$K$107)","v":""},{"$f":"IF(Fixtures!$L$107=\"\",\"\",Fixtures!$L$107)","v":""},null,{"$f":"IF(Fixtures!$K$14=\"\",\"\",Fixtures!$K$14)","v":""},{"$f":"IF(Fixtures!$L$14=\"\",\"\",Fixtures!$L$14)","v":""},null,{"$f":"IF(Fixtures!$K$62=\"\",\"\",Fixtures!$K$62)","v":""},{"$f":"IF(Fixtures!$L$62=\"\",\"\",Fixtures!$L$62)","v":""}]
[null,null,"Newcastle Jets",{"$f":"IF(Fixtures!$K$33=\"\",\"\",Fixtures!$K$33)","v":""},{"$f":"IF(Fixtures!$L$33=\"\",\"\",Fixtures!$L$33)","v":""},null,{"$f":"IF(Fixtures!$K$161=\"\",\"\",Fixtures!$K$161)","v":""},{"$f":"IF(Fixtures!$L$161=\"\",\"\",Fixtures!$L$161)","v":""},null,null,null,null,null,null,null,{"$f":"IF(Fixtures!$K$184=\"\",\"\",Fixtures!$K$184)","v":""},{"$f":"IF(Fixtures!$L$184=\"\",\"\",Fixtures!$L$184)","v":""},null,{"$f":"IF(Fixtures!$K$96=\"\",\"\",Fixtures!$K$96)","v":""},{"$f":"IF(Fixtures!$L$96=\"\",\"\",Fixtures!$L$96)","v":""},null,null,null,null,{"$f":"IF(Fixtures!$K$130=\"\",\"\",Fixtures!$K$130)","v":""},{"$f":"IF(Fixtures!$L$130=\"\",\"\",Fixtures!$L$130)","v":""},null,{"$f":"IF(Fixtures!$K$143=\"\",\"\",Fixtures!$K$143)","v":""},{"$f":"IF(Fixtures!$L$143=\"\",\"\",Fixtures!$L$143)","v":""},null,{"$f":"IF(Fixtures!$K$5=\"\",\"\",Fixtures!$K$5)","v":0},{"$f":"IF(Fixtures!$L$5=\"\",\"\",Fixtures!$L$5)","v":1},null,{"$f":"IF(Fixtures!$K$87=\"\",\"\",Fixtures!$K$87)","v":""},{"$f":"IF(Fixtures!$L$87=\"\",\"\",Fixtures!$L$87)","v":""},null,{"$f":"IF(Fixtures!$K$170=\"\",\"\",Fixtures!$K$170)","v":""},{"$f":"IF(Fixtures!$L$170=\"\",\"\",Fixtures!$L$170)","v":""},null,{"$f":"IF(Fixtures!$K$116=\"\",\"\",Fixtures!$K$116)","v":""},{"$f":"IF(Fixtures!$L$116=\"\",\"\",Fixtures!$L$116)","v":""}]
[null,null,"Western Sydney Wanderers FC",{"$f":"IF(Fixtures!$K$106=\"\",\"\",Fixtures!$K$106)","v":""},{"$f":"IF(Fixtures!$L$106=\"\",\"\",Fixtures!$L$106)","v":""},null,{"$f":"IF(Fixtures!$K$118=\"\",\"\",Fixtures!$K$118)","v":""},{"$f":"IF(Fixtures!$L$118=\"\",\"\",Fixtures!$L$118)","v":""},null,{"$f":"IF(Fixtures!$K$25=\"\",\"\",Fixtures!$K$25)","v":""},{"$f":"IF(Fixtures!$L$25=\"\",\"\",Fixtures!$L$25)","v":""},null,null,null,null,{"$f":"IF(Fixtures!$K$65=\"\",\"\",Fixtures!$K$65)","v":""},{"$f":"IF(Fixtures!$L$65=\"\",\"\",Fixtures!$L$65)","v":""},null,{"$f":"IF(Fixtures!$K$139=\"\",\"\",Fixtures!$K$139)","v":""},{"$f":"IF(Fixtures!$L$139=\"\",\"\",Fixtures!$L$139)","v":""},null,null,null,null,{"$f":"IF(Fixtures!$K$167=\"\",\"\",Fixtures!$K$167)","v":""},{"$f":"IF(Fixtures!$L$167=\"\",\"\",Fixtures!$L$167)","v":""},null,{"$f":"IF(Fixtures!$K$57=\"\",\"\",Fixtures!$K$57)","v":""},{"$f":"IF(Fixtures!$L$57=\"\",\"\",Fixtures!$L$57)","v":""},null,{"$f":"IF(Fixtures!$K$216=\"\",\"\",Fixtures!$K$216)","v":""},{"$f":"IF(Fixtures!$L$216=\"\",\"\",Fixtures!$L$216)","v":""},null,{"$f":"IF(Fixtures!$K$6=\"\",\"\",Fixtures!$K$6)","v":1},{"$f":"IF(Fixtures!$L$6=\"\",\"\",Fixtures!$L$6)","v":2},null,{"$f":"IF(Fixtures!$K$191=\"\",\"\",Fixtures!$K$191)","v":""},{"$f":"IF(Fixtures!$L$191=\"\",\"\",Fixtures!$L$191)","v":""},null,{"$f":"IF(Fixtures!$K$155=\"\",\"\",Fixtures!$K$155)","v":""},{"$f":"IF(Fixtures!$L$155=\"\",\"\",Fixtures!$L$155)","v":""}]
[null,null,"Wellington Phoenix",{"$f":"IF(Fixtures!$K$114=\"\",\"\",Fixtures!$K$114)","v":""},{"$f":"IF(Fixtures!$L$114=\"\",\"\",Fixtures!$L$114)","v":""},null,{"$f":"IF(Fixtures!$K$19=\"\",\"\",Fixtures!$K$19)","v":""},{"$f":"IF(Fixtures!$L$19=\"\",\"\",Fixtures!$L$19)","v":""},null,{"$f":"IF(Fixtures!$K$70=\"\",\"\",Fixtures!$K$70)","v":""},{"$f":"IF(Fixtures!$L$70=\"\",\"\",Fixtures!$L$70)","v":""},null,{"$f":"IF(Fixtures!$K$173=\"\",\"\",Fixtures!$K$173)","v":""},{"$f":"IF(Fixtures!$L$173=\"\",\"\",Fixtures!$L$173)","v":""},null,null,null,null,{"$f":"IF(Fixtures!$K$55=\"\",\"\",Fixtures!$K$55)","v":""},{"$f":"IF(Fixtures!$L$55=\"\",\"\",Fixtures!$L$55)","v":""},null,null,null,null,{"$f":"IF(Fixtures!$K$187=\"\",\"\",Fixtures!$K$187)","v":""},{"$f":"IF(Fixtures!$L$187=\"\",\"\",Fixtures!$L$187)","v":""},null,{"$f":"IF(Fixtures!$K$127=\"\",\"\",Fixtures!$K$127)","v":""},{"$f":"IF(Fixtures!$L$127=\"\",\"\",Fixtures!$L$127)","v":""},null,{"$f":"IF(Fixtures!$K$150=\"\",\"\",Fixtures!$K$150)","v":""},{"$f":"IF(Fixtures!$L$150=\"\",\"\",Fixtures!$L$150)","v":""},null,{"$f":"IF(Fixtures!$K$99=\"\",\"\",Fixtures!$K$99)","v":""},{"$f":"IF(Fixtures!$L$99=\"\",\"\",Fixtures!$L$99)","v":""},null,{"$f":"IF(Fixtures!$K$7=\"\",\"\",Fixtures!$K$7)","v":1},{"$f":"IF(Fixtures!$L$7=\"\",\"\",Fixtures!$L$7)","v":1}]
[null,null,"Macarthur FC","MAC","CCM",null,{"$f":"IF(Fixtures!$K$37=\"\",\"\",Fixtures!$K$37)","v":""},{"$f":"IF(Fixtures!$L$37=\"\",\"\",Fixtures!$L$37)","v":""},null,{"$f":"IF(Fixtures!$K$10=\"\",\"\",Fixtures!$K$10)","v":""},{"$f":"IF(Fixtures!$L$10=\"\",\"\",Fixtures!$L$10)","v":""},null,null,null,null,{"$f":"IF(Fixtures!$K$111=\"\",\"\",Fixtures!$K$111)","v":""},{"$f":"IF(Fixtures!$L$111=\"\",\"\",Fixtures!$L$111)","v":""},null,null,null,null,null,null,null,null,null,null,{"$f":"IF(Fixtures!$K$43=\"\",\"\",Fixtures!$K$43)","v":""},{"$f":"IF(Fixtures!$L$43=\"\",\"\",Fixtures!$L$43)","v":""},null,{"$f":"IF(Fixtures!$K$117=\"\",\"\",Fixtures!$K$117)","v":""},{"$f":"IF(Fixtures!$L$117=\"\",\"\",Fixtures!$L$117)","v":""},null,{"$f":"IF(Fixtures!$K$154=\"\",\"\",Fixtures!$K$154)","v":""},{"$f":"IF(Fixtures!$L$154=\"\",\"\",Fixtures!$L$154)","v":""},null,{"$f":"IF(Fixtures!$K$132=\"\",\"\",Fixtures!$K$132)","v":""},{"$f":"IF(Fixtures!$L$132=\"\",\"\",Fixtures!$L$132)","v":""},null,{"$f":"IF(Fixtures!$K$8=\"\",\"\",Fixtures!$K$8)","v":6},{"$f":"IF(Fixtures!$L$8=\"\",\"\",Fixtures!$L$8)","v":1}]
[null,null,"Adelaide United",{"$f":"IF(Fixtures!$K$11=\"\",\"\",Fixtures!$K$11)","v":""},{"$f":"IF(Fixtures!$L$11=\"\",\"\",Fixtures!$L$11)","v":""},null,{"$f":"IF(Fixtures!$K$103=\"\",\"\",Fixtures!$K$103)","v":""},{"$f":"IF(Fixtures!$L$103=\"\",\"\",Fixtures!$L$103)","v":""},null,{"$f":"IF(Fixtures!$K$138=\"\",\"\",Fixtures!$K$138)","v":""},{"$f":"IF(Fixtures!$L$138=\"\",\"\",Fixtures!$L$138)","v":""},null,{"$f":"IF(Fixtures!$K$68=\"\",\"\",Fixtures!$K$68)","v":""},{"$f":"IF(Fixtures!$L$68=\"\",\"\",Fixtures!$L$68)","v":""},null,{"$f":"IF(Fixtures!$K$214=\"\",\"\",Fixtures!$K$214)","v":""},{"$f":"IF(Fixtures!$L$214=\"\",\"\",Fixtures!$L$214)","v":""},null,{"$f":"IF(Fixtures!$K$165=\"\",\"\",Fixtures!$K$165)","v":""},{"$f":"IF(Fixtures!$L$165=\"\",\"\",Fixtures!$L$165)","v":""},null,null,null,null,{"$f":"IF(Fixtures!$K$110=\"\",\"\",Fixtures!$K$110)","v":""},{"$f":"IF(Fixtures!$L$110=\"\",\"\",Fixtures!$L$110)","v":""},null,{"$f":"IF(Fixtures!$K$158=\"\",\"\",Fixtures!$K$158)","v":""},{"$f":"IF(Fixtures!$L$158=\"\",\"\",Fixtures!$L$158)","v":""},null,{"$f":"IF(Fixtures!$K$128=\"\",\"\",Fixtures!$K$128)","v":""},{"$f":"IF(Fixtures!$L$128=\"\",\"\",Fixtures!$L$128)","v":""},null,{"$f":"IF(Fixtures!$K$183=\"\",\"\",Fixtures!$K$183)","v":""},{"$f":"IF(Fixtures!$L$183=\"\",\"\",Fixtures!$L$183)","v":""},null,{"$f":"IF(Fixtures!$K$28=\"\",\"\",Fixtures!$K$28)","v":""},{"$f":"IF(Fixtures!$L$28=\"\",\"\",Fixtures!$L$28)","v":""},null,{"$f":"IF(Fixtures!$K$39=\"\",\"\",Fixtures!$K$39)","v":""},{"$f":"IF(Fixtures!$L$39=\"\",\"\",Fixtures!$L$39)","v":""}]
[null,null,{"$f":"C10","v":"Melbourne Victory"},{"$f":"IF(Fixtures!$K$160=\"\",\"\",Fixtures!$K$160)","v":""},{"$f":"IF(Fixtures!$L$160=\"\",\"\",Fixtures!$L$160)","v":""},null,{"$f":"IF(Fixtures!$K$215=\"\",\"\",Fixtures!$K$215)","v":""},{"$f":"IF(Fixtures!$L$215=\"\",\"\",Fixtures!$L$215)","v":""},null,null,null,null,{"$f":"IF(Fixtures!$K$88=\"\",\"\",Fixtures!$K$88)","v":""},{"$f":"IF(Fixtures!$L$88=\"\",\"\",Fixtures!$L$88)","v":""},null,{"$f":"IF(Fixtures!$K$135=\"\",\"\",Fixtures!$K$135)","v":""},{"$f":"IF(Fixtures!$L$135=\"\",\"\",Fixtures!$L$135)","v":""},null,{"$f":"IF(Fixtures!$K$22=\"\",\"\",Fixtures!$K$22)","v":""},{"$f":"IF(Fixtures!$L$22=\"\",\"\",Fixtures!$L$22)","v":""},null,null,null,null,null,null,null,{"$f":"IF(Fixtures!$K$26=\"\",\"\",Fixtures!$K$26)","v":""},{"$f":"IF(Fixtures!$L$26=\"\",\"\",Fixtures!$L$26)","v":""},null,{"$f":"IF(Fixtures!$K$64=\"\",\"\",Fixtures!$K$64)","v":""},{"$f":"IF(Fixtures!$L$64=\"\",\"\",Fixtures!$L$64)","v":""},null,{"$f":"IF(Fixtures!$K$113=\"\",\"\",Fixtures!$K$113)","v":""},{"$f":"IF(Fixtures!$L$113=\"\",\"\",Fixtures!$L$113)","v":""},null,{"$f":"IF(Fixtures!$K$91=\"\",\"\",Fixtures!$K$91)","v":""},{"$f":"IF(Fixtures!$L$91=\"\",\"\",Fixtures!$L$91)","v":""},null,{"$f":"IF(Fixtures!$K$52=\"\",\"\",Fixtures!$K$52)","v":""},{"$f":"IF(Fixtures!$L$52=\"\",\"\",Fixtures!$L$52)","v":""}]
[null,null,"Brisbane Roar FC",{"$f":"IF(Fixtures!$K$85=\"\",\"\",Fixtures!$K$85)","v":""},{"$f":"IF(Fixtures!$L$85=\"\",\"\",Fixtures!$L$85)","v":""},null,{"$f":"IF(Fixtures!$K$177=\"\",\"\",Fixtures!$K$177)","v":""},{"$f":"IF(Fixtures!$L$177=\"\",\"\",Fixtures!$L$177)","v":""},null,null,null,null,{"$f":"IF(Fixtures!$K$121=\"\",\"\",Fixtures!$K$121)","v":""},{"$f":"IF(Fixtures!$L$121=\"\",\"\",Fixtures!$L$121)","v":""},null,null,null,null,{"$f":"IF(Fixtures!$K$179=\"\",\"\",Fixtures!$K$179)","v":""},{"$f":"IF(Fixtures!$L$179=\"\",\"\",Fixtures!$L$179)","v":""},null,null,null,null,{"$f":"IF(Fixtures!$K$153=\"\",\"\",Fixtures!$K$153)","v":""},{"$f":"IF(Fixtures!$L$153=\"\",\"\",Fixtures!$L$153)","v":""},null,null,null,null,{"$f":"IF(Fixtures!$K$47=\"\",\"\",Fixtures!$K$47)","v":""},{"$f":"IF(Fixtures!$L$47=\"\",\"\",Fixtures!$L$47)","v":""},null,{"$f":"IF(Fixtures!$K$18=\"\",\"\",Fixtures!$K$18)","v":""},{"$f":"IF(Fixtures!$L$18=\"\",\"\",Fixtures!$L$18)","v":""},null,{"$f":"IF(Fixtures!$K$213=\"\",\"\",Fixtures!$K$213)","v":""},{"$f":"IF(Fixtures!$L$213=\"\",\"\",Fixtures!$L$213)","v":""},null,{"$f":"IF(Fixtures!$K$63=\"\",\"\",Fixtures!$K$63)","v":""},{"$f":"IF(Fixtures!$L$63=\"\",\"\",Fixtures!$L$63)","v":""}]
[null,null,"Melbourne City FC",{"$f":"IF(Fixtures!$K$181=\"\",\"\",Fixtures!$K$181)","v":""},{"$f":"IF(Fixtures!$L$181=\"\",\"\",Fixtures!$L$181)","v":""},null,{"$f":"IF(Fixtures!$K$59=\"\",\"\",Fixtures!$K$59)","v":""},{"$f":"IF(Fixtures!$L$59=\"\",\"\",Fixtures!$L$59)","v":""},null,null,null,null,{"$f":"IF(Fixtures!$K$41=\"\",\"\",Fixtures!$K$41)","v":""},{"$f":"IF(Fixtures!$L$41=\"\",\"\",Fixtures!$L$41)","v":""},null,{"$f":"IF(Fixtures!$K$84=\"\",\"\",Fixtures!$K$84)","v":""},{"$f":"IF(Fixtures!$L$84=\"\",\"\",Fixtures!$L$84)","v":""},null,{"$f":"IF(Fixtures!$K$157=\"\",\"\",Fixtures!$K$157)","v":""},{"$f":"IF(Fixtures!$L$157=\"\",\"\",Fixtures!$L$157)","v":""},null,null,null,null,{"$f":"IF(Fixtures!$K$12=\"\",\"\",Fixtures!$K$12)","v":""},{"$f":"IF(Fixtures!$L$12=\"\",\"\",Fixtures!$L$12)","v":""},null,{"$f":"IF(Fixtures!$K$186=\"\",\"\",Fixtures!$K$186)","v":""},{"$f":"IF(Fixtures!$L$186=\"\",\"\",Fixtures!$L$186)","v":""},null,null,null,null,null,null,null,{"$f":"IF(Fixtures!$K$120=\"\",\"\",Fixtures!$K$120)","v":""},{"$f":"IF(Fixtures!$L$120=\"\",\"\",Fixtures!$L$120)","v":""},null,{"$f":"IF(Fixtures!$K$136=\"\",\"\",Fixtures!$K$136)","v":""},{"$f":"IF(Fixtures!$L$136=\"\",\"\",Fixtures!$L$136)","v":""}]
[null,null,"Sydney FC",{"$f":"IF(Fixtures!$K$94=\"\",\"\",Fixtures!$K$94)","v":""},{"$f":"IF(Fixtures!$L$94=\"\",\"\",Fixtures!$L$94)","v":""},null,{"$f":"IF(Fixtures!$K$188=\"\",\"\",Fixtures!$K$188)","v":""},{"$f":"IF(Fixtures!$L$188=\"\",\"\",Fixtures!$L$188)","v":""},null,{"$f":"IF(Fixtures!$K$218=\"\",\"\",Fixtures!$K$218)","v":""},{"$f":"IF(Fixtures!$L$218=\"\",\"\",Fixtures!$L$218)","v":""},null,{"$f":"IF(Fixtures!$K$131=\"\",\"\",Fixtures!$K$131)","v":""},{"$f":"IF(Fixtures!$L$131=\"\",\"\",Fixtures!$L$131)","v":""},null,{"$f":"IF(Fixtures!$K$166=\"\",\"\",Fixtures!$K$166)","v":""},{"$f":"IF(Fixtures!$L$166=\"\",\"\",Fixtures!$L$166)","v":""},null,{"$f":"IF(Fixtures!$K$27=\"\",\"\",Fixtures!$K$27)","v":""},{"$f":"IF(Fixtures!$L$27=\"\",\"\",Fixtures!$L$27)","v":""},null,null,null,null,{"$f":"IF(Fixtures!$K$72=\"\",\"\",Fixtures!$K$72)","v":""},{"$f":"IF(Fixtures!$L$72=\"\",\"\",Fixtures!$L$72)","v":""},null,{"$f":"IF(Fixtures!$K$108=\"\",\"\",Fixtures!$K$108)","v":""},{"$f":"IF(Fixtures!$L$108=\"\",\"\",Fixtures!$L$108)","v":""},null,{"$f":"IF(Fixtures!$K$174=\"\",\"\",Fixtures!$K$174)","v":""},{"$f":"IF(Fixtures!$L$174=\"\",\"\",Fixtures!$L$174)","v":""},null,null,null,null,{"$f":"IF(Fixtures!$K$56=\"\",\"\",Fixtures!$K$56)","v":""},{"$f":"IF(Fixtures!$L$56=\"\",\"\",Fixtures!$L$56)","v":""}]
[null,null,"Western United FC",null,null,null,{"$f":"IF(Fixtures!$K$137=\"\",\"\",Fixtures!$K$137)","v":""},{"$f":"IF(Fixtures!$L$137=\"\",\"\",Fixtures!$L$137)","v":""},null,{"$f":"IF(Fixtures!$K$109=\"\",\"\",Fixtures!$K$109)","v":""},{"$f":"IF(Fixtures!$L$109=\"\",\"\",Fixtures!$L$109)","v":""},null,{"$f":"IF(Fixtures!$K$15=\"\",\"\",Fixtures!$K$15)","v":""},{"$f":"IF(Fixtures!$L$15=\"\",\"\",Fixtures!$L$15)","v":""},null,null,null,null,{"$f":"IF(Fixtures!$K$50=\"\",\"\",Fixtures!$K$50)","v":""},{"$f":"IF(Fixtures!$L$50=\"\",\"\",Fixtures!$L$50)","v":""},null,null,null,null,{"$f":"IF(Fixtures!$K$42=\"\",\"\",Fixtures!$K$42)","v":""},{"$f":"IF(Fixtures!$L$42=\"\",\"\",Fixtures!$L$42)","v":""},null,{"$f":"IF(Fixtures!$K$73=\"\",\"\",Fixtures!$K$73)","v":""},{"$f":"IF(Fixtures!$L$73=\"\",\"\",Fixtures!$L$73)","v":""},null,{"$f":"IF(Fixtures!$K$23=\"\",\"\",Fixtures!$K$23)","v":""},{"$f":"IF(Fixtures!$L$23=\"\",\"\",Fixtures!$L$23)","v":""},null,null,null,null,null,null,null,{"$f":"IF(Fixtures!$K$182=\"\",\"\",Fixtures!$K$182)","v":""},{"$f":"IF(Fixtures!$L$182=\"\",\"\",Fixtures!$L$182)","v":""}]
[null,null,"Perth Glory",{"$f":"IF(Fixtures!$K$129=\"\",\"\",Fixtures!$K$129)","v":""},{"$f":"IF(Fixtures!$L$129=\"\",\"\",Fixtures!$L$129)","v":""},null,{"$f":"IF(Fixtures!$K$95=\"\",\"\",Fixtures!$K$95)","v":""},{"$f":"IF(Fixtures!$L$95=\"\",\"\",Fixtures!$L$95)","v":""},null,{"$f":"IF(Fixtures!$K$58=\"\",\"\",Fixtures!$K$58)","v":""},{"$f":"IF(Fixtures!$L$58=\"\",\"\",Fixtures!$L$58)","v":""},null,{"$f":"IF(Fixtures!$K$98=\"\",\"\",Fixtures!$K$98)","v":""},{"$f":"IF(Fixtures!$L$98=\"\",\"\",Fixtures!$L$98)","v":""},null,{"$f":"IF(Fixtures!$K$13=\"\",\"\",Fixtures!$K$13)","v":""},{"$f":"IF(Fixtures!$L$13=\"\",\"\",Fixtures!$L$13)","v":""},null,{"$f":"IF(Fixtures!$K$69=\"\",\"\",Fixtures!$K$69)","v":""},{"$f":"IF(Fixtures!$L$69=\"\",\"\",Fixtures!$L$69)","v":""},null,null,null,null,{"$f":"IF(Fixtures!$K$125=\"\",\"\",Fixtures!$K$125)","v":""},{"$f":"IF(Fixtures!$L$125=\"\",\"\",Fixtures!$L$125)","v":""},null,{"$f":"IF(Fixtures!$K$168=\"\",\"\",Fixtures!$K$168)","v":""},{"$f":"IF(Fixtures!$L$168=\"\",\"\",Fixtures!$L$168)","v":""},null,{"$f":"IF(Fixtures!$K$30=\"\",\"\",Fixtures!$K$30)","v":""},{"$f":"IF(Fixtures!$L$30=\"\",\"\",Fixtures!$L$30)","v":""},null,{"$f":"IF(Fixtures!$K$147=\"\",\"\",Fixtures!$K$147)","v":""},{"$f":"IF(Fixtures!$L$147=\"\",\"\",Fixtures!$L$147)","v":""},null,{"$f":"IF(Fixtures!$K$86=\"\",\"\",Fixtures!$K$86)","v":""},{"$f":"IF(Fixtures!$L$86=\"\",\"\",Fixtures!$L$86)","v":""}]

{"sheet":"Ladder","index":2,"n_rows":38,"n_cols":15,"rows_kept":38,"cut":false,"hidden":false,"merged":[]}
[]
[]
[null,{"$f":"Grid!C2","v":"Season Incomplete"},null,null,null,"Home",null,null,null,null,"Away"]
[null,"(Full Ladder)","Played","Won","Drawn","Lost","For","Against","Won","Drawn","Lost","For","Against","Goal Diff",{"$f":"LadderH!AA3","v":"Pts"}]
[null,{"$f":"LadderH!B4","v":"Macarthur FC"},{"$f":"LadderH!T4","v":1},{"$f":"LadderH!D4","v":1},{"$f":"LadderH!E4","v":0},{"$f":"LadderH!F4","v":0},{"$f":"LadderH!G4","v":6},{"$f":"LadderH!H4","v":1},{"$f":"LadderH!L4","v":0},{"$f":"LadderH!M4","v":0},{"$f":"LadderH!N4","v":0},{"$f":"LadderH!O4","v":0},{"$f":"LadderH!P4","v":0},{"$f":"LadderH!Z4","v":5},{"$f":"LadderH!AA4","v":3}]
[null,{"$f":"LadderH!B5","v":"Auckland FC"},{"$f":"LadderH!T5","v":1},{"$f":"LadderH!D5","v":1},{"$f":"LadderH!E5","v":0},{"$f":"LadderH!F5","v":0},{"$f":"LadderH!G5","v":2},{"$f":"LadderH!H5","v":0},{"$f":"LadderH!L5","v":0},{"$f":"LadderH!M5","v":0},{"$f":"LadderH!N5","v":0},{"$f":"LadderH!O5","v":0},{"$f":"LadderH!P5","v":0},{"$f":"LadderH!Z5","v":2},{"$f":"LadderH!AA5","v":3}]
[null,{"$f":"LadderH!B6","v":"Sydney FC"},{"$f":"LadderH!T6","v":1},{"$f":"LadderH!D6","v":0},{"$f":"LadderH!E6","v":0},{"$f":"LadderH!F6","v":0},{"$f":"LadderH!G6","v":0},{"$f":"LadderH!H6","v":0},{"$f":"LadderH!L6","v":1},{"$f":"LadderH!M6","v":0},{"$f":"LadderH!N6","v":0},{"$f":"LadderH!O6","v":2},{"$f":"LadderH!P6","v":1},{"$f":"LadderH!Z6","v":1},{"$f":"LadderH!AA6","v":3}]
[null,{"$f":"LadderH!B7","v":"Melbourne City FC"},{"$f":"LadderH!T7","v":1},{"$f":"LadderH!D7","v":0},{"$f":"LadderH!E7","v":0},{"$f":"LadderH!F7","v":0},{"$f":"LadderH!G7","v":0},{"$f":"LadderH!H7","v":0},{"$f":"LadderH!L7","v":1},{"$f":"LadderH!M7","v":0},{"$f":"LadderH!N7","v":0},{"$f":"LadderH!O7","v":1},{"$f":"LadderH!P7","v":0},{"$f":"LadderH!Z7","v":1},{"$f":"LadderH!AA7","v":3}]
[null,{"$f":"LadderH!B8","v":"Western United FC"},{"$f":"LadderH!T8","v":1},{"$f":"LadderH!D8","v":0},{"$f":"LadderH!E8","v":0},{"$f":"LadderH!F8","v":0},{"$f":"LadderH!G8","v":0},{"$f":"LadderH!H8","v":0},{"$f":"LadderH!L8","v":0},{"$f":"LadderH!M8","v":1},{"$f":"LadderH!N8","v":0},{"$f":"LadderH!O8","v":1},{"$f":"LadderH!P8","v":1},{"$f":"LadderH!Z8","v":0},{"$f":"LadderH!AA8","v":1}]
[null,{"$f":"LadderH!B9","v":"Wellington Phoenix"},{"$f":"LadderH!T9","v":1},{"$f":"LadderH!D9","v":0},{"$f":"LadderH!E9","v":1},{"$f":"LadderH!F9","v":0},{"$f":"LadderH!G9","v":1},{"$f":"LadderH!H9","v":1},{"$f":"LadderH!L9","v":0},{"$f":"LadderH!M9","v":0},{"$f":"LadderH!N9","v":0},{"$f":"LadderH!O9","v":0},{"$f":"LadderH!P9","v":0},{"$f":"LadderH!Z9","v":0},{"$f":"LadderH!AA9","v":1}]
[null,{"$f":"LadderH!B10","v":"Melbourne Victory"},{"$f":"LadderH!T10","v":1},{"$f":"LadderH!D10","v":0},{"$f":"LadderH!E10","v":0},{"$f":"LadderH!F10","v":0},{"$f":"LadderH!G10","v":0},{"$f":"LadderH!H10","v":0},{"$f":"LadderH!L10","v":0},{"$f":"LadderH!M10","v":1},{"$f":"LadderH!N10","v":0},{"$f":"LadderH!O10","v":0},{"$f":"LadderH!P10","v":0},{"$f":"LadderH!Z10","v":0},{"$f":"LadderH!AA10","v":1}]
[null,{"$f":"LadderH!B11","v":"Central Coast Mariners"},{"$f":"LadderH!T11","v":1},{"$f":"LadderH!D11","v":0},{"$f":"LadderH!E11","v":1},{"$f":"LadderH!F11","v":0},{"$f":"LadderH!G11","v":0},{"$f":"LadderH!H11","v":0},{"$f":"LadderH!L11","v":0},{"$f":"LadderH!M11","v":0},{"$f":"LadderH!N11","v":0},{"$f":"LadderH!O11","v":0},{"$f":"LadderH!P11","v":0},{"$f":"LadderH!Z11","v":0},{"$f":"LadderH!AA11","v":1}]
[null,{"$f":"LadderH!B12","v":"Adelaide United"},{"$f":"LadderH!T12","v":0},{"$f":"LadderH!D12","v":0},{"$f":"LadderH!E12","v":0},{"$f":"LadderH!F12","v":0},{"$f":"LadderH!G12","v":0},{"$f":"LadderH!H12","v":0},{"$f":"LadderH!L12","v":0},{"$f":"LadderH!M12","v":0},{"$f":"LadderH!N12","v":0},{"$f":"LadderH!O12","v":0},{"$f":"LadderH!P12","v":0},{"$f":"LadderH!Z12","v":0},{"$f":"LadderH!AA12","v":0}]
[null,{"$f":"LadderH!B13","v":"Western Sydney Wanderers FC"},{"$f":"LadderH!T13","v":1},{"$f":"LadderH!D13","v":0},{"$f":"LadderH!E13","v":0},{"$f":"LadderH!F13","v":1},{"$f":"LadderH!G13","v":1},{"$f":"LadderH!H13","v":2},{"$f":"LadderH!L13","v":0},{"$f":"LadderH!M13","v":0},{"$f":"LadderH!N13","v":0},{"$f":"LadderH!O13","v":0},{"$f":"LadderH!P13","v":0},{"$f":"LadderH!Z13","v":-1},{"$f":"LadderH!AA13","v":0}]
[null,{"$f":"LadderH!B14","v":"Newcastle Jets"},{"$f":"LadderH!T14","v":1},{"$f":"LadderH!D14","v":0},{"$f":"LadderH!E14","v":0},{"$f":"LadderH!F14","v":1},{"$f":"LadderH!G14","v":0},{"$f":"LadderH!H14","v":1},{"$f":"LadderH!L14","v":0},{"$f":"LadderH!M14","v":0},{"$f":"LadderH!N14","v":0},{"$f":"LadderH!O14","v":0},{"$f":"LadderH!P14","v":0},{"$f":"LadderH!Z14","v":-1},{"$f":"LadderH!AA14","v":0}]
[null,{"$f":"LadderH!B15","v":"Brisbane Roar FC"},{"$f":"LadderH!T15","v":1},{"$f":"LadderH!D15","v":0},{"$f":"LadderH!E15","v":0},{"$f":"LadderH!F15","v":0},{"$f":"LadderH!G15","v":0},{"$f":"LadderH!H15","v":0},{"$f":"LadderH!L15","v":0},{"$f":"LadderH!M15","v":0},{"$f":"LadderH!N15","v":1},{"$f":"LadderH!O15","v":0},{"$f":"LadderH!P15","v":2},{"$f":"LadderH!Z15","v":-2},{"$f":"LadderH!AA15","v":0}]
[null,{"$f":"LadderH!B16","v":"Perth Glory"},{"$f":"LadderH!T16","v":1},{"$f":"LadderH!D16","v":0},{"$f":"LadderH!E16","v":0},{"$f":"LadderH!F16","v":0},{"$f":"LadderH!G16","v":0},{"$f":"LadderH!H16","v":0},{"$f":"LadderH!M16","v":0},{"$f":"LadderH!N16","v":1},{"$f":"LadderH!O16","v":1},{"$f":"LadderH!P16","v":6},{"$f":"LadderH!Q16","v":-5},{"$f":"LadderH!Z16","v":-5},{"$f":"LadderH!AA16","v":0}]
[]
[]
[null,{"$f":"B3","v":"Season Incomplete"}]
[null,"(Combined Ladder)","Played","Won","Drawn","Lost","For","Against","Goal Diff",{"$f":"O4","v":"Pts"}]
[null,{"$f":"LadderH!B4","v":"Macarthur FC"},{"$f":"LadderH!T4","v":1},{"$f":"LadderH!U4","v":1},{"$f":"LadderH!V4","v":0},{"$f":"LadderH!W4","v":0},{"$f":"LadderH!X4","v":6},{"$f":"LadderH!Y4","v":1},{"$f":"LadderH!Z4","v":5},{"$f":"LadderH!AA4","v":3}]
[null,{"$f":"LadderH!B5","v":"Auckland FC"},{"$f":"LadderH!T5","v":1},{"$f":"LadderH!U5","v":1},{"$f":"LadderH!V5","v":0},{"$f":"LadderH!W5","v":0},{"$f":"LadderH!X5","v":2},{"$f":"LadderH!Y5","v":0},{"$f":"LadderH!Z5","v":2},{"$f":"LadderH!AA5","v":3}]
[null,{"$f":"LadderH!B6","v":"Sydney FC"},{"$f":"LadderH!T6","v":1},{"$f":"LadderH!U6","v":1},{"$f":"LadderH!V6","v":0},{"$f":"LadderH!W6","v":0},{"$f":"LadderH!X6","v":2},{"$f":"LadderH!Y6","v":1},{"$f":"LadderH!Z6","v":1},{"$f":"LadderH!AA6","v":3}]
[null,{"$f":"LadderH!B7","v":"Melbourne City FC"},{"$f":"LadderH!T7","v":1},{"$f":"LadderH!U7","v":1},{"$f":"LadderH!V7","v":0},{"$f":"LadderH!W7","v":0},{"$f":"LadderH!X7","v":1},{"$f":"LadderH!Y7","v":0},{"$f":"LadderH!Z7","v":1},{"$f":"LadderH!AA7","v":3}]
[null,{"$f":"LadderH!B8","v":"Western United FC"},{"$f":"LadderH!T8","v":1},{"$f":"LadderH!U8","v":0},{"$f":"LadderH!V8","v":1},{"$f":"LadderH!W8","v":0},{"$f":"LadderH!X8","v":1},{"$f":"LadderH!Y8","v":1},{"$f":"LadderH!Z8","v":0},{"$f":"LadderH!AA8","v":1}]
[null,{"$f":"LadderH!B9","v":"Wellington Phoenix"},{"$f":"LadderH!T9","v":1},{"$f":"LadderH!U9","v":0},{"$f":"LadderH!V9","v":1},{"$f":"LadderH!W9","v":0},{"$f":"LadderH!X9","v":1},{"$f":"LadderH!Y9","v":1},{"$f":"LadderH!Z9","v":0},{"$f":"LadderH!AA9","v":1}]
[null,{"$f":"LadderH!B10","v":"Melbourne Victory"},{"$f":"LadderH!T10","v":1},{"$f":"LadderH!U10","v":0},{"$f":"LadderH!V10","v":1},{"$f":"LadderH!W10","v":0},{"$f":"LadderH!X10","v":0},{"$f":"LadderH!Y10","v":0},{"$f":"LadderH!Z10","v":0},{"$f":"LadderH!AA10","v":1}]
[null,{"$f":"LadderH!B11","v":"Central Coast Mariners"},{"$f":"LadderH!T11","v":1},{"$f":"LadderH!U11","v":0},{"$f":"LadderH!V11","v":1},{"$f":"LadderH!W11","v":0},{"$f":"LadderH!X11","v":0},{"$f":"LadderH!Y11","v":0},{"$f":"LadderH!Z11","v":0},{"$f":"LadderH!AA11","v":1}]
[null,{"$f":"LadderH!B12","v":"Adelaide United"},{"$f":"LadderH!T12","v":0},{"$f":"LadderH!U12","v":0},{"$f":"LadderH!V12","v":0},{"$f":"LadderH!W12","v":0},{"$f":"LadderH!X12","v":0},{"$f":"LadderH!Y12","v":0},{"$f":"LadderH!Z12","v":0},{"$f":"LadderH!AA12","v":0}]
[null,{"$f":"LadderH!B13","v":"Western Sydney Wanderers FC"},{"$f":"LadderH!T13","v":1},{"$f":"LadderH!U13","v":0},{"$f":"LadderH!V13","v":0},{"$f":"LadderH!W13","v":1},{"$f":"LadderH!X13","v":1},{"$f":"LadderH!Y13","v":2},{"$f":"LadderH!Z13","v":-1},{"$f":"LadderH!AA13","v":0}]
[null,{"$f":"LadderH!B14","v":"Newcastle Jets"},{"$f":"LadderH!T14","v":1},{"$f":"LadderH!U14","v":0},{"$f":"LadderH!V14","v":0},{"$f":"LadderH!W14","v":1},{"$f":"LadderH!X14","v":0},{"$f":"LadderH!Y14","v":1},{"$f":"LadderH!Z14","v":-1},{"$f":"LadderH!AA14","v":0}]
[null,{"$f":"LadderH!B15","v":"Brisbane Roar FC"},{"$f":"LadderH!T15","v":1},{"$f":"LadderH!U15","v":0},{"$f":"LadderH!V15","v":0},{"$f":"LadderH!W15","v":1},{"$f":"LadderH!X15","v":0},{"$f":"LadderH!Y15","v":2},{"$f":"LadderH!Z15","v":-2},{"$f":"LadderH!AA15","v":0}]
[null,{"$f":"LadderH!B16","v":"Perth Glory"},{"$f":"LadderH!T16","v":1},{"$f":"LadderH!U16","v":0},{"$f":"LadderH!V16","v":0},{"$f":"LadderH!W16","v":1},{"$f":"LadderH!X16","v":1},{"$f":"LadderH!Y16","v":6},{"$f":"LadderH!Z16","v":-5},{"$f":"LadderH!AA16","v":0}]
[]
[]
[]
[null,"From the 2023/24 season, the A-League changed its Ladder rankings to the following order:  Total Points; Games won (where points are tied); *then* Goal Difference, and Goals For."]

{"sheet":"LadderH","index":3,"n_rows":16,"n_cols":27,"rows_kept":16,"cut":false,"hidden":false,"merged":[]}
[]
[]
[null,null,"Ph","Wh","Dh","Lh","Fh","Ah","GDh","Ptsh","Pa","Wa","Da","La","Fa","Aa","Gda","Ptsa",null,"P","W","D","L","F","A","GD","Pts"]
[null,{"$f":"Grid!$AQ$58","v":"Macarthur FC"},{"$f":"Grid!$AR$58","v":1},{"$f":"Grid!$AS$58","v":1},{"$f":"Grid!$AT$58","v":0},{"$f":"Grid!$AU$58","v":0},{"$f":"Grid!$AV$58","v":6},{"$f":"Grid!$AW$58","v":1},{"$f":"Grid!$AX$58","v":5},{"$f":"Grid!$AY$58","v":3},{"$f":"Grid!$BA$58","v":0},{"$f":"Grid!$BB$58","v":0},{"$f":"Grid!$BC$58","v":0},{"$f":"Grid!$BD$58","v":0},{"$f":"Grid!$BE$58","v":0},{"$f":"Grid!$BF$58","v":0},{"$f":"Grid!$BG$58","v":0},{"$f":"Grid!$BH$58","v":0},null,{"$f":"Grid!$BJ$58","v":1},{"$f":"Grid!$BK$58","v":1},{"$f":"Grid!$BL$58","v":0},{"$f":"Grid!$BM$58","v":0},{"$f":"Grid!$BN$58","v":6},{"$f":"Grid!$BO$58","v":1},{"$f":"Grid!$BP$58","v":5},{"$f":"Grid!$BQ$58","v":3}]
[null,{"$f":"Grid!$AQ$54","v":"Auckland FC"},{"$f":"Grid!$AR$54","v":1},{"$f":"Grid!$AS$54","v":1},{"$f":"Grid!$AT$54","v":0},{"$f":"Grid!$AU$54","v":0},{"$f":"Grid!$AV$54","v":2},{"$f":"Grid!$AW$54","v":0},{"$f":"Grid!$AX$54","v":2},{"$f":"Grid!$AY$54","v":3},{"$f":"Grid!$BA$54","v":0},{"$f":"Grid!$BB$54","v":0},{"$f":"Grid!$BC$54","v":0},{"$f":"Grid!$BD$54","v":0},{"$f":"Grid!$BE$54","v":0},{"$f":"Grid!$BF$54","v":0},{"$f":"Grid!$BG$54","v":0},{"$f":"Grid!$BH$54","v":0},null,{"$f":"Grid!$BJ$54","v":1},{"$f":"Grid!$BK$54","v":1},{"$f":"Grid!$BL$54","v":0},{"$f":"Grid!$BM$54","v":0},{"$f":"Grid!$BN$54","v":2},{"$f":"Grid!$BO$54","v":0},{"$f":"Grid!$BP$54","v":2},{"$f":"Grid!$BQ$54","v":3}]
[null,{"$f":"Grid!$AQ$63","v":"Sydney FC"},{"$f":"Grid!$AR$63","v":0},{"$f":"Grid!$AS$63","v":0},{"$f":"Grid!$AT$63","v":0},{"$f":"Grid!$AU$63","v":0},{"$f":"Grid!$AV$63","v":0},{"$f":"Grid!$AW$63","v":0},{"$f":"Grid!$AX$63","v":0},{"$f":"Grid!$AY$63","v":0},{"$f":"Grid!$BA$63","v":1},{"$f":"Grid!$BB$63","v":1},{"$f":"Grid!$BC$63","v":0},{"$f":"Grid!$BD$63","v":0},{"$f":"Grid!$BE$63","v":2},{"$f":"Grid!$BF$63","v":1},{"$f":"Grid!$BG$63","v":1},{"$f":"Grid!$BH$63","v":3},null,{"$f":"Grid!$BJ$63","v":1},{"$f":"Grid!$BK$63","v":1},{"$f":"Grid!$BL$63","v":0},{"$f":"Grid!$BM$63","v":0},{"$f":"Grid!$BN$63","v":2},{"$f":"Grid!$BO$63","v":1},{"$f":"Grid!$BP$63","v":1},{"$f":"Grid!$BQ$63","v":3}]
[null,{"$f":"Grid!$AQ$62","v":"Melbourne City FC"},{"$f":"Grid!$AR$62","v":0},{"$f":"Grid!$AS$62","v":0},{"$f":"Grid!$AT$62","v":0},{"$f":"Grid!$AU$62","v":0},{"$f":"Grid!$AV$62","v":0},{"$f":"Grid!$AW$62","v":0},{"$f":"Grid!$AX$62","v":0},{"$f":"Grid!$AY$62","v":0},{"$f":"Grid!$BA$62","v":1},{"$f":"Grid!$BB$62","v":1},{"$f":"Grid!$BC$62","v":0},{"$f":"Grid!$BD$62","v":0},{"$f":"Grid!$BE$62","v":1},{"$f":"Grid!$BF$62","v":0},{"$f":"Grid!$BG$62","v":1},{"$f":"Grid!$BH$62","v":3},null,{"$f":"Grid!$BJ$62","v":1},{"$f":"Grid!$BK$62","v":1},{"$f":"Grid!$BL$62","v":0},{"$f":"Grid!$BM$62","v":0},{"$f":"Grid!$BN$62","v":1},{"$f":"Grid!$BO$62","v":0},{"$f":"Grid!$BP$62","v":1},{"$f":"Grid!$BQ$62","v":3}]
[null,{"$f":"Grid!$AQ$64","v":"Western United FC"},{"$f":"Grid!$AR$64","v":0},{"$f":"Grid!$AS$64","v":0},{"$f":"Grid!$AT$64","v":0},{"$f":"Grid!$AU$64","v":0},{"$f":"Grid!$AV$64","v":0},{"$f":"Grid!$AW$64","v":0},{"$f":"Grid!$AX$64","v":0},{"$f":"Grid!$AY$64","v":0},{"$f":"Grid!$BA$64","v":1},{"$f":"Grid!$BB$64","v":0},{"$f":"Grid!$BC$64","v":1},{"$f":"Grid!$BD$64","v":0},{"$f":"Grid!$BE$64","v":1},{"$f":"Grid!$BF$64","v":1},{"$f":"Grid!$BG$64","v":0},{"$f":"Grid!$BH$64","v":1},null,{"$f":"Grid!$BJ$64","v":1},{"$f":"Grid!$BK$64","v":0},{"$f":"Grid!$BL$64","v":1},{"$f":"Grid!$BM$64","v":0},{"$f":"Grid!$BN$64","v":1},{"$f":"Grid!$BO$64","v":1},{"$f":"Grid!$BP$64","v":0},{"$f":"Grid!$BQ$64","v":1}]
[null,{"$f":"Grid!$AQ$57","v":"Wellington Phoenix"},{"$f":"Grid!$AR$57","v":1},{"$f":"Grid!$AS$57","v":0},{"$f":"Grid!$AT$57","v":1},{"$f":"Grid!$AU$57","v":0},{"$f":"Grid!$AV$57","v":1},{"$f":"Grid!$AW$57","v":1},{"$f":"Grid!$AX$57","v":0},{"$f":"Grid!$AY$57","v":1},{"$f":"Grid!$BA$57","v":0},{"$f":"Grid!$BB$57","v":0},{"$f":"Grid!$BC$57","v":0},{"$f":"Grid!$BD$57","v":0},{"$f":"Grid!$BE$57","v":0},{"$f":"Grid!$BF$57","v":0},{"$f":"Grid!$BG$57","v":0},{"$f":"Grid!$BH$57","v":0},null,{"$f":"Grid!$BJ$57","v":1},{"$f":"Grid!$BK$57","v":0},{"$f":"Grid!$BL$57","v":1},{"$f":"Grid!$BM$57","v":0},{"$f":"Grid!$BN$57","v":1},{"$f":"Grid!$BO$57","v":1},{"$f":"Grid!$BP$57","v":0},{"$f":"Grid!$BQ$57","v":1}]
[null,{"$f":"Grid!$AQ$60","v":"Melbourne Victory"},{"$f":"Grid!$AR$60","v":0},{"$f":"Grid!$AS$60","v":0},{"$f":"Grid!$AT$60","v":0},{"$f":"Grid!$AU$60","v":0},{"$f":"Grid!$AV$60","v":0},{"$f":"Grid!$AW$60","v":0},{"$f":"Grid!$AX$60","v":0},{"$f":"Grid!$AY$60","v":0},{"$f":"Grid!$BA$60","v":1},{"$f":"Grid!$BB$60","v":0},{"$f":"Grid!$BC$60","v":1},{"$f":"Grid!$BD$60","v":0},{"$f":"Grid!$BE$60","v":0},{"$f":"Grid!$BF$60","v":0},{"$f":"Grid!$BG$60","v":0},{"$f":"Grid!$BH$60","v":1},null,{"$f":"Grid!$BJ$60","v":1},{"$f":"Grid!$BK$60","v":0},{"$f":"Grid!$BL$60","v":1},{"$f":"Grid!$BM$60","v":0},{"$f":"Grid!$BN$60","v":0},{"$f":"Grid!$BO$60","v":0},{"$f":"Grid!$BP$60","v":0},{"$f":"Grid!$BQ$60","v":1}]
[null,{"$f":"Grid!$AQ$53","v":"Central Coast Mariners"},{"$f":"Grid!$AR$53","v":1},{"$f":"Grid!$AS$53","v":0},{"$f":"Grid!$AT$53","v":1},{"$f":"Grid!$AU$53","v":0},{"$f":"Grid!$AV$53","v":0},{"$f":"Grid!$AW$53","v":0},{"$f":"Grid!$AX$53","v":0},{"$f":"Grid!$AY$53","v":1},{"$f":"Grid!$BA$53","v":0},{"$f":"Grid!$BB$53","v":0},{"$f":"Grid!$BC$53","v":0},{"$f":"Grid!$BD$53","v":0},{"$f":"Grid!$BE$53","v":0},{"$f":"Grid!$BF$53","v":0},{"$f":"Grid!$BG$53","v":0},{"$f":"Grid!$BH$53","v":0},null,{"$f":"Grid!$BJ$53","v":1},{"$f":"Grid!$BK$53","v":0},{"$f":"Grid!$BL$53","v":1},{"$f":"Grid!$BM$53","v":0},{"$f":"Grid!$BN$53","v":0},{"$f":"Grid!$BO$53","v":0},{"$f":"Grid!$BP$53","v":0},{"$f":"Grid!$BQ$53","v":1}]
[null,{"$f":"Grid!$AQ$59","v":"Adelaide United"},{"$f":"Grid!$AR$59","v":0},{"$f":"Grid!$AS$59","v":0},{"$f":"Grid!$AT$59","v":0},{"$f":"Grid!$AU$59","v":0},{"$f":"Grid!$AV$59","v":0},{"$f":"Grid!$AW$59","v":0},{"$f":"Grid!$AX$59","v":0},{"$f":"Grid!$AY$59","v":0},{"$f":"Grid!$BA$59","v":0},{"$f":"Grid!$BB$59","v":0},{"$f":"Grid!$BC$59","v":0},{"$f":"Grid!$BD$59","v":0},{"$f":"Grid!$BE$59","v":0},{"$f":"Grid!$BF$59","v":0},{"$f":"Grid!$BG$59","v":0},{"$f":"Grid!$BH$59","v":0},null,{"$f":"Grid!$BJ$59","v":0},{"$f":"Grid!$BK$59","v":0},{"$f":"Grid!$BL$59","v":0},{"$f":"Grid!$BM$59","v":0},{"$f":"Grid!$BN$59","v":0},{"$f":"Grid!$BO$59","v":0},{"$f":"Grid!$BP$59","v":0},{"$f":"Grid!$BQ$59","v":0}]
[null,{"$f":"Grid!$AQ$56","v":"Western Sydney Wanderers FC"},{"$f":"Grid!$AR$56","v":1},{"$f":"Grid!$AS$56","v":0},{"$f":"Grid!$AT$56","v":0},{"$f":"Grid!$AU$56","v":1},{"$f":"Grid!$AV$56","v":1},{"$f":"Grid!$AW$56","v":2},{"$f":"Grid!$AX$56","v":-1},{"$f":"Grid!$AY$56","v":0},{"$f":"Grid!$BA$56","v":0},{"$f":"Grid!$BB$56","v":0},{"$f":"Grid!$BC$56","v":0},{"$f":"Grid!$BD$56","v":0},{"$f":"Grid!$BE$56","v":0},{"$f":"Grid!$BF$56","v":0},{"$f":"Grid!$BG$56","v":0},{"$f":"Grid!$BH$56","v":0},null,{"$f":"Grid!$BJ$56","v":1},{"$f":"Grid!$BK$56","v":0},{"$f":"Grid!$BL$56","v":0},{"$f":"Grid!$BM$56","v":1},{"$f":"Grid!$BN$56","v":1},{"$f":"Grid!$BO$56","v":2},{"$f":"Grid!$BP$56","v":-1},{"$f":"Grid!$BQ$56","v":0}]
[null,{"$f":"Grid!$AQ$55","v":"Newcastle Jets"},{"$f":"Grid!$AR$55","v":1},{"$f":"Grid!$AS$55","v":0},{"$f":"Grid!$AT$55","v":0},{"$f":"Grid!$AU$55","v":1},{"$f":"Grid!$AV$55","v":0},{"$f":"Grid!$AW$55","v":1},{"$f":"Grid!$AX$55","v":-1},{"$f":"Grid!$AY$55","v":0},{"$f":"Grid!$BA$55","v":0},{"$f":"Grid!$BB$55","v":0},{"$f":"Grid!$BC$55","v":0},{"$f":"Grid!$BD$55","v":0},{"$f":"Grid!$BE$55","v":0},{"$f":"Grid!$BF$55","v":0},{"$f":"Grid!$BG$55","v":0},{"$f":"Grid!$BH$55","v":0},null,{"$f":"Grid!$BJ$55","v":1},{"$f":"Grid!$BK$55","v":0},{"$f":"Grid!$BL$55","v":0},{"$f":"Grid!$BM$55","v":1},{"$f":"Grid!$BN$55","v":0},{"$f":"Grid!$BO$55","v":1},{"$f":"Grid!$BP$55","v":-1},{"$f":"Grid!$BQ$55","v":0}]
[null,{"$f":"Grid!$AQ$61","v":"Brisbane Roar FC"},{"$f":"Grid!$AR$61","v":0},{"$f":"Grid!$AS$61","v":0},{"$f":"Grid!$AT$61","v":0},{"$f":"Grid!$AU$61","v":0},{"$f":"Grid!$AV$61","v":0},{"$f":"Grid!$AW$61","v":0},{"$f":"Grid!$AX$61","v":0},{"$f":"Grid!$AY$61","v":0},{"$f":"Grid!$BA$61","v":1},{"$f":"Grid!$BB$61","v":0},{"$f":"Grid!$BC$61","v":0},{"$f":"Grid!$BD$61","v":1},{"$f":"Grid!$BE$61","v":0},{"$f":"Grid!$BF$61","v":2},{"$f":"Grid!$BG$61","v":-2},{"$f":"Grid!$BH$61","v":0},null,{"$f":"Grid!$BJ$61","v":1},{"$f":"Grid!$BK$61","v":0},{"$f":"Grid!$BL$61","v":0},{"$f":"Grid!$BM$61","v":1},{"$f":"Grid!$BN$61","v":0},{"$f":"Grid!$BO$61","v":2},{"$f":"Grid!$BP$61","v":-2},{"$f":"Grid!$BQ$61","v":0}]
[null,{"$f":"Grid!$AQ$65","v":"Perth Glory"},{"$f":"Grid!$AR$65","v":0},{"$f":"Grid!$AS$65","v":0},{"$f":"Grid!$AT$65","v":0},{"$f":"Grid!$AU$65","v":0},{"$f":"Grid!$AV$65","v":0},{"$f":"Grid!$AW$65","v":0},{"$f":"Grid!$AX$65","v":0},{"$f":"Grid!$AY$65","v":0},{"$f":"Grid!$BA$65","v":1},{"$f":"Grid!$BB$65","v":0},{"$f":"Grid!$BC$65","v":0},{"$f":"Grid!$BD$65","v":1},{"$f":"Grid!$BE$65","v":1},{"$f":"Grid!$BF$65","v":6},{"$f":"Grid!$BG$65","v":-5},{"$f":"Grid!$BH$65","v":0},null,{"$f":"Grid!$BJ$65","v":1},{"$f":"Grid!$BK$65","v":0},{"$f":"Grid!$BL$65","v":0},{"$f":"Grid!$BM$65","v":1},{"$f":"Grid!$BN$65","v":1},{"$f":"Grid!$BO$65","v":6},{"$f":"Grid!$BP$65","v":-5},{"$f":"Grid!$BQ$65","v":0}]

{"sheet":"Finals","index":4,"n_rows":39,"n_cols":23,"rows_kept":39,"cut":false,"hidden":false,"merged":[[9,2,9,3]]}
[]
[null,"Top Six",{"$f":"Ladder!B3","v":"Season Incomplete"}]
[null,1,{"$f":"Ladder!B5","v":"Macarthur FC"}]
[null,2,{"$f":"Ladder!B6","v":"Auckland FC"}]
[null,3,{"$f":"Ladder!B7","v":"Sydney FC"}]
[null,4,{"$f":"Ladder!B8","v":"Melbourne City FC"}]
[null,5,{"$f":"Ladder!B9","v":"Western United FC"}]
[null,6,{"$f":"Ladder!B10","v":"Wellington Phoenix"}]
[]
[null,null,{"$f":"Fixtures!D160+7","v":"2025-03-15"}]
[null,"Elimination Finals 9-11 May",null,null,null,null,"Semi-Finals - First Leg 16-18 May; Second Leg 23-25 May",null,null,null,null,null,null,null,null,null,null,null,"Preliminary Final - 16/17 May 2015",null,null,null,"Grand Final Sun 31 May - 1 June"]
[null,null,null,null,null,null,null,null,{"$f":"IF(Finals!H14=\"\",\"\",IF(AND(FinalsH!J11=FinalsH!J12,FinalsH!H11=FinalsH!D11),\"Pens\",\"\"))","v":""}]
[null,null,null,null,null,null,{"$f":"FinalsH!G11","v":"Macarthur FC"},null,null,null,null,null,null,null,null,null,null,null,null,null,null,null,{"$f":"FinalsH!O11","v":"Winner 1 v 2"}]
[null,null,null,null,null,null,{"$f":"FinalsH!G12","v":"Auckland FC"},null,null,null,null,null,null,null,null,null,null,null,null,null,{"$f":"FinalsH!M12","v":""},null,{"$f":"FinalsH!O12","v":"Winner Preliminary Final"}]
[]
[null,null,null,null,null,null,null,null,{"$f":"IF(Finals!H20=\"\",\"\",IF(AND(FinalsH!J17=FinalsH!J18,FinalsH!H17=FinalsH!D15),\"Pens\",\"\"))","v":""},null,null,null,null,null,null,null,null,null,{"$f":"FinalsH!K14","v":"Loser 1 v 2"}]
[null,{"$f":"FinalsH!B15","v":3},{"$f":"FinalsH!C15","v":"Sydney FC"},null,null,null,null,null,null,null,null,null,null,null,null,null,null,null,{"$f":"FinalsH!K15","v":"Winner Minor SF"}]
[null,{"$f":"FinalsH!B16","v":6},{"$f":"FinalsH!C16","v":"Wellington Phoenix"}]
[null,null,null,null,null,null,{"$f":"FinalsH!G17","v":"Winner 4 v 5"}]
[null,null,null,null,null,null,{"$f":"FinalsH!G18","v":"Winner 3 v 6"}]
[null,{"$f":"FinalsH!B19","v":4},{"$f":"FinalsH!C19","v":"Melbourne City FC"}]
[null,{"$f":"FinalsH!B20","v":5},{"$f":"FinalsH!C20","v":"Western United FC"}]
[]
[]
[]
[]
[]
[null,null,null,null,null,null,{"$f":"FinalsH!G38","v":"Lower-ranked EF Winner"},null,null,null,{"$f":"IF(C2=\"Season Incomplete\",\"First-placed team\",FinalsH!K38)","v":"First-placed team"}]
[null,{"$f":"FinalsH!B39","v":3},{"$f":"IF(C2=\"Season Incomplete\",\"Third-placed team\",FinalsH!C39)","v":"Third-placed team"},null,null,null,{"$f":"IF(C2=\"Season Incomplete\",\"First-placed team\",FinalsH!G39)","v":"First-placed team"},null,null,null,{"$f":"FinalsH!K39","v":"Lower-ranked EF Winner"}]
[null,{"$f":"FinalsH!B40","v":6},{"$f":"IF(C2=\"Season Incomplete\",\"Sixth-placed team\",FinalsH!C40)","v":"Sixth-placed team"},null,null,null,null,null,null,null,null,null,null,null,null,null,null,null,null,null,null,null,{"$f":"FinalsH!O40","v":"Higher-ranked SF Winner"}]
[null,null,null,null,null,null,null,null,null,null,null,null,null,null,null,null,null,null,null,null,null,null,{"$f":"FinalsH!O41","v":"Lower-ranked SF Winner"}]
[null,null,null,null,null,null,{"$f":"FinalsH!G42","v":"Higher-ranked EF Winner"},null,null,null,{"$f":"IF(C2=\"Season Incomplete\",\"Second-placed team\",FinalsH!K42)","v":"Second-placed team"}]
[null,{"$f":"FinalsH!B43","v":4},{"$f":"IF(C2=\"Season Incomplete\",\"Fourth-placed team\",FinalsH!C43)","v":"Fourth-placed team"},null,null,null,{"$f":"IF(C2=\"Season Incomplete\",\"Second-placed team\",FinalsH!G43)","v":"Second-placed team"},null,null,null,{"$f":"FinalsH!K43","v":"Higher-ranked EF Winner"}]
[null,{"$f":"FinalsH!B44","v":5},{"$f":"IF(C2=\"Season Incomplete\",\"Fifth-placed team\",FinalsH!C44)","v":"Fifth-placed team"}]
[]
[]
[]
[]
[null,null,null,null,null,null,"*  (Finals dates TBC)"]

{"sheet":"FinalsH","index":5,"n_rows":54,"n_cols":23,"rows_kept":54,"cut":false,"hidden":false,"merged":[]}
[]
[null,null,{"$f":"Ladder!B3","v":"Season Incomplete"}]
[null,1,{"$f":"Ladder!B5","v":"Macarthur FC"}]
[null,2,{"$f":"Ladder!B6","v":"Auckland FC"}]
[null,3,{"$f":"Ladder!B7","v":"Sydney FC"}]
[null,4,{"$f":"Ladder!B8","v":"Melbourne City FC"}]
[null,5,{"$f":"Ladder!B9","v":"Western United FC"}]
[null,6,{"$f":"Ladder!B10","v":"Wellington Phoenix"}]
[null,7,{"$f":"Ladder!B11","v":"Melbourne Victory"}]
[null,null,null,null,null,null,null,null,{"$f":"IF(Finals!H14=\"\",\"\",IF(AND(FinalsH!J11=FinalsH!J12,FinalsH!H11=FinalsH!D11),\"Pens\",\"\"))","v":""}]
[null,{"$f":"B24","v":2},{"$f":"IF(C2=\"Season Complete\",C24,\"2nd-Ranked Team\")","v":"2nd-Ranked Team"},{"$f":"IF(Finals!D13=\"\",\"\",Finals!D13)","v":""},null,null,{"$f":"C3","v":"Macarthur FC"},{"$f":"IF(Finals!H13=\"\",\"\",Finals!H13)","v":""},{"$f":"IF(Finals!I13=\"\",\"\",Finals!I13)","v":""},{"$f":"H11","v":""},null,null,null,null,{"$f":"IF(H11=\"\",\"Winner 1 v 2\",IF(H12=\"\",\"Winner 1 v 2\",IF(H11>H12,G11,IF(H12>H11,G12,IF(AND(H11=H12,I12=\"\"),\"Winner 1 v 2\",IF(AND(H11=H12,I11>I12),G11,IF(AND(H11=H12,I12>I11),G12,\"Winner 1 v 2\")))))))","v":"Winner 1 v 2"}]
[null,{"$f":"B25","v":1},{"$f":"IF(C2=\"Season Complete\",C25,\"1st-Ranked Team\")","v":"1st-Ranked Team"},{"$f":"IF(Finals!D14=\"\",\"\",Finals!D14)","v":""},null,null,{"$f":"C4","v":"Auckland FC"},{"$f":"IF(Finals!H14=\"\",\"\",Finals!H14)","v":""},{"$f":"IF(Finals!I14=\"\",\"\",Finals!I14)","v":""},{"$f":"H12","v":""},null,null,{"$f":"IF(L15=\"\",\"\",IF(L14=L15,\"Pens\",\"\"))","v":""},null,{"$f":"IF(K15=\"Winner Minor SF\",\"Winner Preliminary Final\",IF(L15=\"\",\"Winner Preliminary Final\",IF(L14>L15,K14,IF(L14<L15,K15,IF(AND(L14=L15,M15=\"\"),\"Winner Preliminary Final\",IF(AND(L14=L15,M14>M15),K14,IF(AND(L14=L15,M14<M15),K15,\"Winner Preliminary Final\")))))))","v":"Winner Preliminary Final"}]
[]
[null,null,null,null,null,null,null,null,{"$f":"IF(Finals!H20=\"\",\"\",IF(AND(FinalsH!J17=FinalsH!J18,FinalsH!H17=FinalsH!D15),\"Pens\",\"\"))","v":""},null,{"$f":"IF(O11=G11,G12,IF(O11=G12,G11,\"Loser 1 v 2\"))","v":"Loser 1 v 2"},{"$f":"IF(Finals!T16=\"\",\"\",Finals!T16)","v":""},{"$f":"IF(Finals!U16=\"\",\"\",Finals!U16)","v":""}]
[null,3,{"$f":"C5","v":"Sydney FC"},{"$f":"IF(Finals!D17=\"\",\"\",Finals!D17)","v":""},{"$f":"IF(Finals!E17=\"\",\"\",Finals!E17)","v":""},null,null,null,null,null,{"$f":"IF(H17=\"\",\"Winner Minor SF\",IF(H18=\"\",\"Winner Minor SF\",IF(H17>H18,G17,IF(H18>H17,G18,IF(AND(H17=H18,I18=\"\"),\"Winner Minor SF\",IF(AND(H17=H18,I17>I18),G17,IF(AND(H17=H18,I18>I17),G18,\"Winner Minor SF\")))))))","v":"Winner Minor SF"},{"$f":"IF(Finals!T17=\"\",\"\",Finals!T17)","v":""},{"$f":"IF(Finals!U17=\"\",\"\",Finals!U17)","v":""}]
[null,6,{"$f":"C8","v":"Wellington Phoenix"},{"$f":"IF(Finals!D18=\"\",\"\",Finals!D18)","v":""},{"$f":"IF(Finals!E18=\"\",\"\",Finals!E18)","v":""}]
[null,null,null,null,null,null,{"$f":"C32","v":"Winner 4 v 5"},null,null,{"$f":"IF(H17=\"\",\"\",IF(H18=\"\",\"\",SUM(D16)+SUM(H17)))","v":""}]
[null,null,null,null,null,null,{"$f":"C33","v":"Winner 3 v 6"},null,null,{"$f":"IF(H17=\"\",\"\",IF(H18=\"\",\"\",SUM(D15)+SUM(H18)))","v":""}]
[null,4,{"$f":"C6","v":"Melbourne City FC"},{"$f":"IF(Finals!D21=\"\",\"\",Finals!D21)","v":""},{"$f":"IF(Finals!E21=\"\",\"\",Finals!E21)","v":""}]
[null,5,{"$f":"C7","v":"Western United FC"},{"$f":"IF(Finals!D22=\"\",\"\",Finals!D22)","v":""},{"$f":"IF(Finals!E22=\"\",\"\",Finals!E22)","v":""},null,null,"H","I","J"]
[]
[]
[null,"Posn","Team","Sort","Orig"]
[null,{"$f":"$B$4","v":2},{"$f":"$C$4","v":"Auckland FC"},1,1]
[null,{"$f":"$B$3","v":1},{"$f":"$C$3","v":"Macarthur FC"},2,2]
[]
[null,null,"Team"]
[null,{"$f":"$B$6","v":4},{"$f":"IF(D15=\"\",\"Winner 3 v 6\",IF(D16=\"\",\"Winner 3 v 6\",IF(D15>D16,C15,IF(D16>D15,C16,IF(AND(D15=D16,E16=\"\"),\"Winner 3 v 6\",IF(AND(D15=D16,E15>E16),C15,IF(AND(D15=D16,E16>E15),C16,\"Winner 3 v 6\")))))))","v":"Winner 3 v 6"},1,1]
[null,{"$f":"$B$5","v":3},{"$f":"IF(D19=\"\",\"Winner 4 v 5\",IF(D20=\"\",\"Winner 4 v 5\",IF(D19>D20,C19,IF(D20>D19,C20,IF(AND(D19=D20,E20=\"\"),\"Winner 4 v 5\",IF(AND(D19=D20,E19>E20),C19,IF(AND(D19=D20,E20>E19),C20,\"Winner 4 v 5\")))))))","v":"Winner 4 v 5"},2,2]
[]
[null,null,"Team","Sort","Orig"]
[null,null,{"$f":"$C$29","v":"Winner 4 v 5"},1,1]
[null,null,{"$f":"$C$28","v":"Winner 3 v 6"},2,2]
[]
[]
[null,null,null,null,null,null,null,null,null,null,null,null,null,null,null,null,null,null,null,"T","U","V","W"]
[null,null,null,null,null,null,null,null,null,null,null,null,null,null,null,null,null,null,null,1,2,"P","Agg"]
[null,null,null,null,null,null,{"$f":"IF(C48=\"Winner 3 v 6\",\"Lower-ranked EF Winner\",IF(C48=C39,C52,IF(C48=C40,C40)))","v":"Lower-ranked EF Winner"},{"$f":"IF(Finals!H28=\"\",\"\",Finals!H28)","v":""},null,null,{"$f":"G39","v":"Macarthur FC"},{"$f":"IF(Finals!L28=\"\",\"\",Finals!L28)","v":""},{"$f":"IF(Finals!N28=\"\",\"\",Finals!N28)","v":""},null,null,null,null,null,{"$f":"G38","v":"Lower-ranked EF Winner"},{"$f":"IF(H38=\"\",\"\",H38)","v":""},{"$f":"IF(L39=\"\",\"\",L39)","v":""},{"$f":"IF(M39=\"\",\"\",M39)","v":""},{"$f":"IF(T38=\"\",\"\",IF(U38=\"\",\"\",SUM(T38+SUM(U38))))","v":""}]
[null,3,{"$f":"C15","v":"Sydney FC"},{"$f":"IF(Finals!D29=\"\",\"\",Finals!D29)","v":""},{"$f":"IF(Finals!E29=\"\",\"\",Finals!E29)","v":""},null,{"$f":"C3","v":"Macarthur FC"},{"$f":"IF(Finals!H29=\"\",\"\",Finals!H29)","v":""},null,null,{"$f":"G38","v":"Lower-ranked EF Winner"},{"$f":"IF(Finals!L29=\"\",\"\",Finals!L29)","v":""},{"$f":"IF(Finals!N29=\"\",\"\",Finals!N29)","v":""},null,null,null,null,null,{"$f":"G39","v":"Macarthur FC"},{"$f":"IF(H39=\"\",\"\",H39)","v":""},{"$f":"IF(L38=\"\",\"\",L38)","v":""},{"$f":"IF(M38=\"\",\"\",M38)","v":""},{"$f":"IF(T39=\"\",\"\",IF(U39=\"\",\"\",SUM(T39+SUM(U39))))","v":""}]
[null,6,{"$f":"C16","v":"Wellington Phoenix"},{"$f":"IF(Finals!D30=\"\",\"\",Finals!D30)","v":""},{"$f":"IF(Finals!E30=\"\",\"\",Finals!E30)","v":""},null,null,null,null,null,null,null,null,null,{"$f":"IF(G47=\"Winner SF1\",\"Higher-ranked SF Winner\",IF(G47=G38,G38,G51))","v":"Higher-ranked SF Winner"},{"$f":"IF(Finals!X30=\"\",\"\",Finals!X30)","v":""},{"$f":"IF(Finals!Y30=\"\",\"\",Finals!Y30)","v":""}]
[null,null,null,null,null,null,null,null,null,null,null,null,null,null,{"$f":"IF(G51=\"Winner SF2\",\"Lower-ranked SF Winner\",IF(G47=G39,G47,IF(H43=\"\",\"Lower-ranked SF Winner\",IF(G47=G39,G39,G51))))","v":"Lower-ranked SF Winner"},{"$f":"IF(Finals!X31=\"\",\"\",Finals!X31)","v":""},{"$f":"IF(Finals!Y31=\"\",\"\",Finals!Y31)","v":""},null,null,1,2,"P","Agg"]
[null,null,null,null,null,null,{"$f":"IF(G39=\"Winner 4 v 5\",C48,IF(C48=\"Winner 3 v 6\",\"Higher-ranked EF Winner\",IF(C39=C48,C48,C52)))","v":"Higher-ranked EF Winner"},{"$f":"IF(Finals!H32=\"\",\"\",Finals!H32)","v":""},{"$f":"IF(Finals!I32=\"\",\"\",Finals!I32)","v":""},null,{"$f":"G43","v":"Auckland FC"},{"$f":"IF(Finals!L32=\"\",\"\",Finals!L32)","v":""},{"$f":"IF(Finals!N32=\"\",\"\",Finals!N32)","v":""},null,null,null,null,null,{"$f":"G42","v":"Higher-ranked EF Winner"},{"$f":"H42","v":""},{"$f":"L43","v":""},{"$f":"IF(M43=\"\",\"\",M43)","v":""},{"$f":"IF(T42=\"\",\"\",IF(U42=\"\",\"\",SUM(T42+SUM(U42))))","v":""}]
[null,4,{"$f":"C19","v":"Melbourne City FC"},{"$f":"IF(Finals!D33=\"\",\"\",Finals!D33)","v":""},{"$f":"IF(Finals!E33=\"\",\"\",Finals!E33)","v":""},null,{"$f":"C4","v":"Auckland FC"},{"$f":"IF(Finals!H33=\"\",\"\",Finals!H33)","v":""},{"$f":"IF(Finals!I33=\"\",\"\",Finals!I33)","v":""},null,{"$f":"G42","v":"Higher-ranked EF Winner"},{"$f":"IF(Finals!L33=\"\",\"\",Finals!L33)","v":""},{"$f":"IF(Finals!N33=\"\",\"\",Finals!N33)","v":""},null,null,null,null,null,{"$f":"G43","v":"Auckland FC"},{"$f":"H43","v":""},{"$f":"L42","v":""},{"$f":"IF(M42=\"\",\"\",M42)","v":""},{"$f":"IF(T43=\"\",\"\",IF(U43=\"\",\"\",SUM(T43+SUM(U43))))","v":""}]
[null,5,{"$f":"C20","v":"Western United FC"},{"$f":"IF(Finals!D34=\"\",\"\",Finals!D34)","v":""},{"$f":"IF(Finals!E34=\"\",\"\",Finals!E34)","v":""}]
[]
[]
[null,null,null,null,null,null,{"$f":"IF(W38=\"\",\"Winner SF1\",IF(W39=\"\",\"Winner SF1\",IF(W38>W39,G38,IF(W38<W39,G39,IF(AND(W38=W39,V39=\"\"),\"Winner SF1\",IF(AND(W38=W39,V38>V39),G38,IF(AND(W38=W39,V38<V39),G39,\"Winner SF1\")))))))","v":"Winner SF1"}]
[null,null,{"$f":"IF(D39=\"\",\"Winner 3 v 6\",IF(D40=\"\",\"Winner 3 v 6\",IF(D39>D40,C39,IF(D39<D40,C40,IF(AND(D39=D40,E40=\"\"),\"Winner 3 v 6\",IF(AND(D39=D40,E39>E40),C39,IF(AND(D39=D40,E39<E40),C40,\"Winner 3 v 6\")))))))","v":"Winner 3 v 6"}]
[]
[]
[null,null,null,null,null,null,{"$f":"IF(W42=\"\",\"Winner SF2\",IF(W43=\"\",\"Winner SF2\",IF(W42>W43,G42,IF(W42<W43,G43,IF(AND(W42=W43,V43=\"\"),\"Winner SF2\",IF(AND(W42=W43,V42>V43),G42,IF(AND(W42=W43,V42<V43),G43,\"Winner SF2\")))))))","v":"Winner SF2"}]
[null,null,{"$f":"IF(D43=\"\",\"Winner 4 v 5\",IF(D44=\"\",\"Winner 4 v 5\",IF(D43>D44,C43,IF(D43<D44,C44,IF(AND(D43=D44,E44=\"\"),\"Winner 4 v 5\",IF(AND(D43=D44,E43>E44),C43,IF(AND(D43=D44,E43<E44),C44,\"Winner 4 v 5\")))))))","v":"Winner 4 v 5"}]
[]
[null,null,null,null,null,null,{"$f":"IF(H42=\"\",\"Winner SF2\",IF(H43=\"\",\"Winner SF2\",IF(H42>H43,G42,IF(H42<H43,G43,IF(AND(H42=H43,I43=\"\"),\"Winner SF2\",IF(AND(H42=H43,I42>I43),G42,IF(AND(H42=H43,I42<I43),G43,\"Winner SF2\")))))))","v":"Winner SF2"}]