{"text_format":"1","workbook":"xlsx","n_sheets":7,"sheets":["Sheet1","Fixtures","Grid","Ladder","Ladder1","McRopod","Module1"],"not_rendered":{"charts":0,"images":0,"macros":1,"external_links":0,"defined_names":7,"comments":0,"pivot_tables":0},"unopened":[{"sheet":"Module1","index":6,"reason":"part_missing"}],"bounds":{"document_bytes":16777216,"sheet_cells":100000,"rows_first":2000,"rows_last":500,"rows_between":2000,"halvings":0,"cell_chars":16384,"cell_head_chars":4096},"cells_cut":0,"cells_raw":0,"read":"whole","date_system":"1900"}

{"sheet":"Sheet1","index":0,"n_rows":206,"n_cols":11,"rows_kept":206,"cut":false,"hidden":true,"merged":[]}
[]
[]
[]
[null,1,"2019-08-03","Aberdeen","v","Heart of Midlothian","ABD","HEA",null,1,2]
[null,1,"2019-08-03","Celtic","v","St Johnstone","CEL","STJ",null,12,4]
[null,1,"2019-08-03","Hibernian","v","St Mirren","HIB","STM",null,5,6]
[null,1,"2019-08-03","Livingston","v","Motherwell","LIV","MOT",null,7,8]
[null,1,"2019-08-03","Ross County","v","Hamilton Academical","RCT","HAM",null,9,10]
[null,1,"2019-08-04","Kilmarnock","v","Rangers","KIL","RAN",null,11,3]
[null,{"$f":"B4+1","v":2},"2019-08-10","Hamilton Academical","v","Kilmarnock","HAM","KIL",null,10,11]
[null,2,"2019-08-10","Heart of Midlothian","v","Ross County","HEA","RCT",null,2,9]
[null,2,"2019-08-10","Motherwell","v","Celtic","MOT","CEL",null,8,12]
[null,2,"2019-08-10","Rangers","v","Hibernian","RAN","HIB",null,3,5]
[null,2,"2019-08-10","St Johnstone","v","Livingston","STJ","LIV",null,4,7]
[null,2,"2019-08-10","St Mirren","v","Aberdeen","STM","ABD",null,6,1]
[null,3,"2019-08-24","Celtic","v","Heart of Midlothian","CEL","HEA",null,12,2]
[null,3,"2019-08-24","Hamilton Academical","v","Motherwell","HAM","MOT",null,10,8]
[null,3,"2019-08-24","Hibernian","v","St Johnstone","HIB","STJ",null,5,4]
[null,3,"2019-08-24","Kilmarnock","v","Aberdeen","KIL","ABD",null,11,1]
[null,3,"2019-08-24","Ross County","v","Livingston","RCT","LIV",null,9,7]
[null,3,"2019-08-24","St Mirren","v","Rangers","STM","RAN",null,6,3]
[null,4,"2019-08-31","Aberdeen","v","Ross County","ABD","RCT",null,1,9]
[null,4,"2019-08-31","Heart of Midlothian","v","Hamilton Academical","HEA","HAM",null,2,10]
[null,4,"2019-08-31","Livingston","v","St Mirren","LIV","STM",null,7,6]
[null,4,"2019-08-31","Motherwell","v","Hibernian","MOT","HIB",null,8,5]
[null,4,"2019-08-31","Rangers","v","Celtic","RAN","CEL",null,3,12]
[null,4,"2019-08-31","St Johnstone","v","Kilmarnock","STJ","KIL",null,4,11]
[]
[null,{"$f":"B22+1","v":5},"2019-09-14","Aberdeen","v","St Johnstone","ABD","STJ",null,1,4]
[null,5,"2019-09-14","Hamilton Academical","v","Celtic","HAM","CEL",null,10,12]
[null,5,"2019-09-14","Heart of Midlothian","v","Motherwell","HEA","MOT",null,2,8]
[null,5,"2019-09-14","Kilmarnock","v","Hibernian","KIL","HIB",null,11,5]
[null,5,"2019-09-14","Rangers","v","Livingston","RAN","LIV",null,3,7]
[null,5,"2019-09-14","Ross County","v","St Mirren","RCT","STM",null,9,6]
[null,{"$f":"B29+1","v":6},"2019-09-21","Celtic","v","Kilmarnock","CEL","KIL",null,12,11]
[null,6,"2019-09-21","Hibernian","v","Heart of Midlothian","HIB","HEA",null,5,2]
[null,6,"2019-09-21","Livingston","v","Aberdeen","LIV","ABD",null,7,1]
[null,6,"2019-09-21","Motherwell","v","Ross County","MOT","RCT",null,8,9]
[null,6,"2019-09-21","St Johnstone","v","Rangers","STJ","RAN",null,4,3]
[null,6,"2019-09-21","St Mirren","v","Hamilton Academical","STM","HAM",null,6,10]
[null,7,"2019-09-28","Hamilton Academical","v","Livingston","HAM","LIV",null,10,7]
[null,7,"2019-09-28","Hibernian","v","Celtic","HIB","CEL",null,5,12]
[null,7,"2019-09-28","Kilmarnock","v","Ross County","KIL","RCT",null,11,9]
[null,7,"2019-09-28","Rangers","v","Aberdeen","RAN","ABD",null,3,1]
[null,7,"2019-09-28","St Johnstone","v","Motherwell","STJ","MOT",null,4,8]
[null,7,"2019-09-28","St Mirren","v","Heart of Midlothian","STM","HEA",null,6,2]
[null,8,"2019-10-05","Aberdeen","v","Hibernian","ABD","HIB",null,1,5]
[null,8,"2019-10-05","Heart of Midlothian","v","Kilmarnock","HEA","KIL",null,2,11]
[null,8,"2019-10-05","Livingston","v","Celtic","LIV","CEL",null,7,12]
[null,8,"2019-10-05","Motherwell","v","St Mirren","MOT","STM",null,8,6]
[null,8,"2019-10-05","Rangers","v","Hamilton Academical","RAN","HAM",null,3,10]
[null,8,"2019-10-05","Ross County","v","St Johnstone","RCT","STJ",null,9,4]
[null,9,"2019-10-19","Celtic","v","Ross County","CEL","RCT",null,12,9]
[null,9,"2019-10-19","Hamilton Academical","v","Hibernian","HAM","HIB",null,10,5]
[null,9,"2019-10-19","Heart of Midlothian","v","Rangers","HEA","RAN",null,2,3]
[null,9,"2019-10-19","Kilmarnock","v","Livingston","KIL","LIV",null,11,7]
[null,9,"2019-10-19","Motherwell","v","Aberdeen","MOT","ABD",null,8,1]
[null,9,"2019-10-19","St Mirren","v","St Johnstone","STM","STJ",null,6,4]
[null,10,"2019-10-26","Aberdeen","v","Celtic","ABD","CEL",null,1,12]
[null,10,"2019-10-26","Hibernian","v","Ross County","HIB","RCT",null,5,9]
[null,10,"2019-10-26","Kilmarnock","v","St Mirren","KIL","STM",null,11,6]
[null,10,"2019-10-26","Livingston","v","Heart of Midlothian","LIV","HEA",null,7,2]
[null,10,"2019-10-26","Rangers","v","Motherwell","RAN","MOT",null,3,8]
[null,10,"2019-10-26","St Johnstone","v","Hamilton Academical","STJ","HAM",null,4,10]
[null,11,"2019-10-30","Celtic","v","St Mirren","CEL","STM",null,12,6]
[null,11,"2019-10-30","Hamilton Academical","v","Aberdeen","HAM","ABD",null,10,1]
[null,11,"2019-10-30","Hibernian","v","Livingston","HIB","LIV",null,5,7]
[null,11,"2019-10-30","Motherwell","v","Kilmarnock","MOT","KIL",null,8,11]
[null,11,"2019-10-30","Ross County","v","Rangers","RCT","RAN",null,9,3]
[null,11,"2019-10-30","St Johnstone","v","Heart of Midlothian","STJ","HEA",null,4,2]
[]
[null,{"$f":"B65+1","v":12},"2019-11-02","Aberdeen","v","Kilmarnock","ABD","KIL",null,1,11]
[null,12,"2019-11-02","Hamilton Academical","v","Ross County","HAM","RCT",null,10,9]
[null,12,"2019-11-02","Heart of Midlothian","v","Celtic","HEA","CEL",null,2,12]
[null,12,"2019-11-02","Motherwell","v","Livingston","MOT","LIV",null,8,7]
[null,12,"2019-11-02","Rangers","v","St Johnstone","RAN","STJ",null,3,4]
[null,12,"2019-11-02","St Mirren","v","Hibernian","STM","HIB",null,6,5]
[null,{"$f":"B72+1","v":13},"2019-11-09","Celtic","v","Motherwell","CEL","MOT",null,12,8]
[null,13,"2019-11-09","Heart of Midlothian","v","St Mirren","HEA","STM",null,2,6]
[null,13,"2019-11-09","Kilmarnock","v","Hamilton Academical","KIL","HAM",null,11,10]
[null,13,"2019-11-09","Livingston","v","Rangers","LIV","RAN",null,7,3]
[null,13,"2019-11-09","Ross County","v","Aberdeen","RCT","ABD",null,9,1]
[null,13,"2019-11-09","St Johnstone","v","Hibernian","STJ","HIB",null,4,5]
[null,14,"2019-11-23","Celtic","v","Livingston","CEL","LIV",null,12,7]
[null,14,"2019-11-23","Hamilton Academical","v","Rangers","HAM","RAN",null,10,3]
[null,14,"2019-11-23","Hibernian","v","Motherwell","HIB","MOT",null,5,8]
[null,14,"2019-11-23","Kilmarnock","v","Heart of Midlothian","KIL","HEA",null,11,2]
[null,14,"2019-11-23","St Johnstone","v","Aberdeen","STJ","ABD",null,4,1]
[null,14,"2019-11-23","St Mirren","v","Ross County","STM","RCT",null,6,9]
[null,15,"2019-11-30","Aberdeen","v","St Mirren","ABD","STM",null,1,6]
[null,15,"2019-11-30","Hibernian","v","Kilmarnock","HIB","KIL",null,5,11]
[null,15,"2019-11-30","Livingston","v","Hamilton Academical","LIV","HAM",null,7,10]
[null,15,"2019-11-30","Motherwell","v","St Johnstone","MOT","STJ",null,8,4]
[null,15,"2019-11-30","Rangers","v","Heart of Midlothian","RAN","HEA",null,3,2]
[null,15,"2019-11-30","Ross County","v","Celtic","RCT","CEL",null,9,12]
[null,16,"2019-12-04","Aberdeen","v","Rangers","ABD","RAN",null,1,3]
[null,16,"2019-12-04","Celtic","v","Hamilton Academical","CEL","HAM",null,12,10]
[null,16,"2019-12-04","Heart of Midlothian","v","Livingston","HEA","LIV",null,2,7]
[null,16,"2019-12-04","Kilmarnock","v","St Johnstone","KIL","STJ",null,11,4]
[null,16,"2019-12-04","Ross County","v","Hibernian","RCT","HIB",null,9,5]
[null,16,"2019-12-04","St Mirren","v","Motherwell","STM","MOT",null,6,8]
[null,17,"2019-12-07","Hamilton Academical","v","St Mirren","HAM","STM",null,10,6]
[null,17,"2019-12-07","Hibernian","v","Aberdeen","HIB","ABD",null,5,1]
[null,17,"2019-12-07","Livingston","v","Kilmarnock","LIV","KIL",null,7,11]
[null,17,"2019-12-07","Motherwell","v","Heart of Midlothian","MOT","HEA",null,8,2]
[null,17,"2019-12-07","Rangers","v","Ross County","RAN","RCT",null,3,9]
[null,17,"2019-12-07","St Johnstone","v","Celtic","STJ","CEL",null,4,12]
[null,18,"2019-12-14","Aberdeen","v","Hamilton Academical","ABD","HAM",null,1,10]
[null,18,"2019-12-14","Celtic","v","Hibernian","CEL","HIB",null,12,5]
[null,18,"2019-12-14","Heart of Midlothian","v","St Johnstone","HEA","STJ",null,2,4]
[null,18,"2019-12-14","Motherwell","v","Rangers","MOT","RAN",null,8,3]
[null,18,"2019-12-14","Ross County","v","Kilmarnock","RCT","KIL",null,9,11]
[null,18,"2019-12-14","St Mirren","v","Livingston","STM","LIV",null,6,7]
[]
[null,{"$f":"B108+1","v":19},"2019-12-21","Celtic","v","Aberdeen","CEL","ABD",null,12,1]
[null,19,"2019-12-21","Hamilton Academical","v","Heart of Midlothian","HAM","HEA",null,10,2]
[null,19,"2019-12-21","Hibernian","v","Rangers","HIB","RAN",null,5,3]
[null,19,"2019-12-21","Kilmarnock","v","Motherwell","KIL","MOT",null,11,8]
[null,19,"2019-12-21","Livingston","v","Ross County","LIV","RCT",null,7,9]
[null,19,"2019-12-21","St Johnstone","v","St Mirren","STJ","STM",null,4,6]
[null,{"$f":"B115+1","v":20},"2019-12-26","Aberdeen","v","Livingston","ABD","LIV",null,1,7]
[null,20,"2019-12-26","Hamilton Academical","v","St Johnstone","HAM","STJ",null,10,4]
[null,20,"2019-12-26","Heart of Midlothian","v","Hibernian","HEA","HIB",null,2,5]
[null,20,"2019-12-26","Rangers","v","Kilmarnock","RAN","KIL",null,3,11]
[null,20,"2019-12-26","Ross County","v","Motherwell","RCT","MOT",null,9,8]
[null,20,"2019-12-26","St Mirren","v","Celtic","STM","CEL",null,6,12]
[null,21,"2019-12-29","Celtic","v","Rangers","CEL","RAN",null,12,3]
[null,21,"2019-12-29","Heart of Midlothian","v","Aberdeen","HEA","ABD",null,2,1]
[null,21,"2019-12-29","Livingston","v","Hibernian","LIV","HIB",null,7,5]
[null,21,"2019-12-29","Motherwell","v","Hamilton Academical","MOT","HAM",null,8,10]
[null,21,"2019-12-29","St Johnstone","v","Ross County","STJ","RCT",null,4,9]
[null,21,"2019-12-29","St Mirren","v","Kilmarnock","STM","KIL",null,6,11]
[null,22,"2020-01-22","Aberdeen","v","Motherwell","ABD","MOT",null,1,8]
[null,22,"2020-01-22","Hibernian","v","Hamilton Academical","HIB","HAM",null,5,10]
[null,22,"2020-01-22","Kilmarnock","v","Celtic","KIL","CEL",null,11,12]
[null,22,"2020-01-22","Livingston","v","St Johnstone","LIV","STJ",null,7,4]
[null,22,"2020-01-22","Rangers","v","St Mirren","RAN","STM",null,3,6]
[null,22,"2020-01-22","Ross County","v","Heart of Midlothian","RCT","HEA",null,9,2]
[null,23,"2020-01-25","Celtic","v","Ross County","CEL","RCT",null,12,9]
[null,23,"2020-01-25","Hamilton Academical","v","Livingston","HAM","LIV",null,10,7]
[null,23,"2020-01-25","Heart of Midlothian","v","Rangers","HEA","RAN",null,2,3]
[null,23,"2020-01-25","Motherwell","v","Hibernian","MOT","HIB",null,8,5]
[null,23,"2020-01-25","St Johnstone","v","Kilmarnock","STJ","KIL",null,4,11]
[null,23,"2020-01-25","St Mirren","v","Aberdeen","STM","ABD",null,6,1]
[null,24,"2020-02-01","Hamilton Academical","v","Celtic","HAM","CEL",null,10,12]
[null,24,"2020-02-01","Hibernian","v","St Mirren","HIB","STM",null,5,6]
[null,24,"2020-02-01","Kilmarnock","v","Ross County","KIL","RCT",null,11,9]
[null,24,"2020-02-01","Livingston","v","Motherwell","LIV","MOT",null,7,8]
[null,24,"2020-02-01","Rangers","v","Aberdeen","RAN","ABD",null,3,1]
[null,24,"2020-02-01","St Johnstone","v","Heart of Midlothian","STJ","HEA",null,4,2]
[null,25,"2020-02-05","Aberdeen","v","St Johnstone","ABD","STJ",null,1,4]
[null,25,"2020-02-05","Heart of Midlothian","v","Kilmarnock","HEA","KIL",null,2,11]
[null,25,"2020-02-05","Motherwell","v","Celtic","MOT","CEL",null,8,12]
[null,25,"2020-02-05","Rangers","v","Hibernian","RAN","HIB",null,3,5]
[null,25,"2020-02-05","Ross County","v","Livingston","RCT","LIV",null,9,7]
[null,25,"2020-02-05","St Mirren","v","Hamilton Academical","STM","HAM",null,6,10]
[]
[null,{"$f":"B151+1","v":26},"2020-02-12","Celtic","v","Heart of Midlothian","CEL","HEA",null,12,2]
[null,26,"2020-02-12","Hamilton Academical","v","Aberdeen","HAM","ABD",null,10,1]
[null,26,"2020-02-12","Hibernian","v","Ross County","HIB","RCT",null,5,9]
[null,26,"2020-02-12","Kilmarnock","v","Rangers","KIL","RAN",null,11,3]
[null,26,"2020-02-12","Livingston","v","St Mirren","LIV","STM",null,7,6]
[null,26,"2020-02-12","St Johnstone","v","Motherwell","STJ","MOT",null,4,8]
[null,{"$f":"B158+1","v":27},"2020-02-15","Aberdeen","v","Celtic","ABD","CEL",null,1,12]
[null,27,"2020-02-15","Heart of Midlothian","v","Hamilton Academical","HEA","HAM",null,2,10]
[null,27,"2020-02-15","Kilmarnock","v","Hibernian","KIL","HIB",null,11,5]
[null,27,"2020-02-15","Motherwell","v","St Mirren","MOT","STM",null,8,6]
[null,27,"2020-02-15","Rangers","v","Livingston","RAN","LIV",null,3,7]
[null,27,"2020-02-15","Ross County","v","St Johnstone","RCT","STJ",null,9,4]
[null,28,"2020-02-22","Aberdeen","v","Ross County","ABD","RCT",null,1,9]
[null,28,"2020-02-22","Celtic","v","Kilmarnock","CEL","KIL",null,12,11]
[null,28,"2020-02-22","Hamilton Academical","v","Motherwell","HAM","MOT",null,10,8]
[null,28,"2020-02-22","Hibernian","v","Livingston","HIB","LIV",null,5,7]
[null,28,"2020-02-22","St Johnstone","v","Rangers","STJ","RAN",null,4,3]
[null,28,"2020-02-22","St Mirren","v","Heart of Midlothian","STM","HEA",null,6,2]
[null,29,"2020-03-04","Hibernian","v","Heart of Midlothian","HIB","HEA",null,5,2]
[null,29,"2020-03-04","Kilmarnock","v","Aberdeen","KIL","ABD",null,11,1]
[null,29,"2020-03-04","Livingston","v","Celtic","LIV","CEL",null,7,12]
[null,29,"2020-03-04","Motherwell","v","Ross County","MOT","RCT",null,8,9]
[null,29,"2020-03-04","Rangers","v","Hamilton Academical","RAN","HAM",null,3,10]
[null,29,"2020-03-04","St Mirren","v","St Johnstone","STM","STJ",null,6,4]
[null,30,"2020-03-07","Aberdeen","v","Hibernian","ABD","HIB",null,1,5]
[null,30,"2020-03-07","Celtic","v","St Mirren","CEL","STM",null,12,6]
[null,30,"2020-03-07","Hamilton Academical","v","Kilmarnock","HAM","KIL",null,10,11]
[null,30,"2020-03-07","Heart of Midlothian","v","Motherwell","HEA","MOT",null,2,8]
[null,30,"2020-03-07","Ross County","v","Rangers","RCT","RAN",null,9,3]
[null,30,"2020-03-07","St Johnstone","v","Livingston","STJ","LIV",null,4,7]
[null,31,"2020-03-14","Hibernian","v","St Johnstone","HIB","STJ",null,5,4]
[null,31,"2020-03-14","Kilmarnock","v","St Mirren","KIL","STM",null,11,6]
[null,31,"2020-03-14","Livingston","v","Heart of Midlothian","LIV","HEA",null,7,2]
[null,31,"2020-03-14","Motherwell","v","Aberdeen","MOT","ABD",null,8,1]
[null,31,"2020-03-14","Rangers","v","Celtic","RAN","CEL",null,3,12]
[null,31,"2020-03-14","Ross County","v","Hamilton Academical","RCT","HAM",null,9,10]
[null,32,"2020-03-21","Celtic","v","St Johnstone","CEL","STJ",null,12,4]
[null,32,"2020-03-21","Hamilton Academical","v","Hibernian","HAM","HIB",null,10,5]
[null,32,"2020-03-21","Heart of Midlothian","v","Ross County","HEA","RCT",null,2,9]
[null,32,"2020-03-21","Livingston","v","Aberdeen","LIV","ABD",null,7,1]
[null,32,"2020-03-21","Motherwell","v","Kilmarnock","MOT","KIL",null,8,11]
[null,32,"2020-03-21","St Mirren","v","Rangers","STM","RAN",null,6,3]
[]
[null,{"$f":"B194+1","v":33},"2020-04-04","Aberdeen","v","Heart of Midlothian","ABD","HEA",null,1,2]
[null,33,"2020-04-04","Hibernian","v","Celtic","HIB","CEL",null,5,12]
[null,33,"2020-04-04","Kilmarnock","v","Livingston","KIL","LIV",null,11,7]
[null,33,"2020-04-04","Rangers","v","Motherwell","RAN","MOT",null,3,8]
[null,33,"2020-04-04","Ross County","v","St Mirren","RCT","STM",null,9,6]
[null,33,"2020-04-04","St Johnstone","v","Hamilton Academical","STJ","HAM",null,4,10]

{"sheet":"Fixtures","index":1,"n_rows":236,"n_cols":15,"rows_kept":236,"cut":false,"hidden":false,"merged":[]}
[null,null,null,null,null,null,null,null,"v1 - Pre-Split"]
[null,"Round","Date","Time","Home",null,"Away"]
[null,null,"2024-08-03","12:30:00","Heart of Midlothian","v","Rangers",0,0,null,"HEA","RAN",null,1,2]
[null,null,"2024-08-03","15:00:00","Motherwell","v","Ross County",0,0,null,"MOT","RCT",null,3,4]
[null,null,"2024-08-04","16:30:00","Celtic","v","Kilmarnock",4,0,null,"CEL","KIL",null,12,5]
[null,null,"2024-08-04","13:30:00","Dundee United","v","Dundee",2,2,null,"DUT","DDE",null,6,7]
[null,null,"2024-08-04","15:00:00","St Mirren","v","Hibernian",3,0,null,"MIR","HIB",null,8,9]
[null,null,"2024-08-05","20:00:00","St Johnstone","v","Aberdeen",1,2,null,"JOH","ABD",null,10,11]
[null,null,"2024-08-11","15:00:00","Aberdeen","v","St Mirren",3,1,null,"ABD","MIR",null,11,8]
[null,null,"2024-08-10","17:30:00","Dundee","v","Heart of Midlothian",3,1,null,"DDE","HEA",null,7,1]
[null,null,"2024-08-10","15:00:00","Kilmarnock","v","St Johnstone",0,3,null,"KIL","JOH",null,5,10]
[null,null,"2024-08-10","15:00:00","Rangers","v","Motherwell",2,1,null,"RAN","MOT",null,2,3]
[null,null,"2024-08-10","15:00:00","Ross County","v","Dundee United",1,1,null,"RCT","DUT",null,4,6]
[null,null,"2024-08-11","12:30:00","Hibernian","v","Celtic",0,2,null,"HIB","CEL",null,9,12]
[null,null,"2024-08-24","15:00:00","Aberdeen","v","Kilmarnock",2,0,null,"ABD","KIL",null,11,5]
[null,null,"2024-08-24","15:00:00","Dundee United","v","St Johnstone",2,0,null,"DUT","JOH",null,6,10]
[null,null,"2024-08-24","15:00:00","Hibernian","v","Dundee",2,2,null,"HIB","DDE",null,9,7]
[null,null,"2024-08-25","15:00:00","Motherwell","v","Heart of Midlothian",3,1,null,"MOT","HEA",null,3,1]
[null,null,"2024-08-24","15:00:00","Rangers","v","Ross County",6,0,null,"RAN","RCT",null,2,4]
[null,null,"2024-08-25","12:00:00","St Mirren","v","Celtic",0,3,null,"MIR","CEL",null,8,12]
[null,null,"2024-09-01","12:30:00","Celtic","v","Rangers",3,0,null,"CEL","RAN",null,12,2]
[null,null,"2024-08-31","15:00:00","Dundee","v","St Mirren",2,2,null,"DDE","MIR",null,7,8]
[null,null,"2024-08-31","15:00:00","Heart of Midlothian","v","Dundee United",0,1,null,"HEA","DUT",null,1,6]
[null,null,"2024-08-31","15:00:00","Kilmarnock","v","Hibernian",1,1,null,"KIL","HIB",null,5,9]
[null,null,"2024-08-31","17:45:00","Ross County","v","Aberdeen",0,1,null,"RCT","ABD",null,4,11]
[null,null,"2024-08-31","15:00:00","St Johnstone","v","Motherwell",1,2,null,"JOH","MOT",null,10,3]
[null,"McRopod Concepts Sports System:     Scottish Premier League 2024/2025 (Pre-Split to Rd 33)"]
[null,null,"2024-09-14","15:00:00","Aberdeen","v","Motherwell",null,null,null,"ABD","MOT",null,11,3]
[null,null,"2024-09-14","15:00:00","Celtic","v","Heart of Midlothian",null,null,null,"CEL","HEA",null,12,1]
[null,null,"2024-09-15","12:00:00","Dundee United","v","Rangers",null,null,null,"DUT","RAN",null,6,2]
[null,null,"2024-09-14","15:00:00","Hibernian","v","St Johnstone",null,null,null,"HIB","JOH",null,9,10]
[null,null,"2024-09-14","15:00:00","Ross County","v","Dundee",null,null,null,"RCT","DDE",null,4,7]
[null,null,"2024-09-14","15:00:00","St Mirren","v","Kilmarnock",null,null,null,"MIR","KIL",null,8,5]
[null,null,"2024-09-28","15:00:00","Dundee","v","Aberdeen",null,null,null,"DDE","ABD",null,7,11]
[null,null,"2024-09-28","15:00:00","Heart of Midlothian","v","Ross County",null,null,null,"HEA","RCT",null,1,4]
[null,null,"2024-09-28","15:00:00","Kilmarnock","v","Dundee United",null,null,null,"KIL","DUT",null,5,6]
[null,null,"2024-09-28","15:00:00","Motherwell","v","St Mirren",null,null,null,"MOT","MIR",null,3,8]
[null,null,"2024-09-28","15:00:00","Rangers","v","Hibernian",null,null,null,"RAN","HIB",null,2,9]
[null,null,"2024-09-28","15:00:00","St Johnstone","v","Celtic",null,null,null,"JOH","CEL",null,10,12]
[null,null,"2024-10-05","15:00:00","Aberdeen","v","Heart of Midlothian",null,null,null,"ABD","HEA",null,11,1]
[null,null,"2024-10-05","15:00:00","Dundee","v","Kilmarnock",null,null,null,"DDE","KIL",null,7,5]
[null,null,"2024-10-05","15:00:00","Hibernian","v","Motherwell",null,null,null,"HIB","MOT",null,9,3]
[null,null,"2024-10-05","15:00:00","Rangers","v","St Johnstone",null,null,null,"RAN","JOH",null,2,10]
[null,null,"2024-10-05","15:00:00","Ross County","v","Celtic",null,null,null,"RCT","CEL",null,4,12]
[null,null,"2024-10-05","15:00:00","St Mirren","v","Dundee United",null,null,null,"MIR","DUT",null,8,6]
[null,null,"2024-10-19","15:00:00","Celtic","v","Aberdeen",null,null,null,"CEL","ABD",null,12,11]
[null,null,"2024-10-19","15:00:00","Dundee United","v","Hibernian",null,null,null,"DUT","HIB",null,6,9]
[null,null,"2024-10-19","15:00:00","Heart of Midlothian","v","St Mirren",null,null,null,"HEA","MIR",null,1,8]
[null,null,"2024-10-19","15:00:00","Kilmarnock","v","Rangers",null,null,null,"KIL","RAN",null,5,2]
[null,null,"2024-10-19","15:00:00","Motherwell","v","Dundee",null,null,null,"MOT","DDE",null,3,7]
[null,null,"2024-10-19","15:00:00","St Johnstone","v","Ross County",null,null,null,"JOH","RCT",null,10,4]
[null,null,"2024-10-26","15:00:00","Aberdeen","v","Dundee United",null,null,null,"ABD","DUT",null,11,6]
[null,null,"2024-10-26","15:00:00","Dundee","v","St Johnstone",null,null,null,"DDE","JOH",null,7,10]
[null,null,"2024-10-26","15:00:00","Hibernian","v","Heart of Midlothian",null,null,null,"HIB","HEA",null,9,1]
[null,null,"2024-10-26","15:00:00","Motherwell","v","Celtic",null,null,null,"MOT","CEL",null,3,12]
[null,null,"2024-10-26","15:00:00","Rangers","v","St Mirren",null,null,null,"RAN","MIR",null,2,8]
[null,null,"2024-10-26","15:00:00","Ross County","v","Kilmarnock",null,null,null,"RCT","KIL",null,4,5]
[null,null,"2024-10-30","19:45:00","Aberdeen","v","Rangers",null,null,null,"ABD","RAN",null,11,2]
[null,null,"2024-10-30","19:45:00","Celtic","v","Dundee",null,null,null,"CEL","DDE",null,12,7]
[null,null,"2024-10-30","19:45:00","Dundee United","v","Motherwell",null,null,null,"DUT","MOT",null,6,3]
[null,null,"2024-10-30","19:45:00","Heart of Midlothian","v","Kilmarnock",null,null,null,"HEA","KIL",null,1,5]
[null,null,"2024-10-30","19:45:00","Ross County","v","Hibernian",null,null,null,"RCT","HIB",null,4,9]
[null,null,"2024-10-30","19:45:00","St Mirren","v","St Johnstone",null,null,null,"MIR","JOH",null,8,10]
[null,null,"2024-11-02","15:00:00","Celtic","v","Dundee United",null,null,null,"CEL","DUT",null,12,6]
[null,null,"2024-11-02","15:00:00","Dundee","v","Rangers",null,null,null,"DDE","RAN",null,7,2]
[null,null,"2024-11-02","15:00:00","Hibernian","v","Aberdeen",null,null,null,"HIB","ABD",null,9,11]
[null,null,"2024-11-02","15:00:00","Kilmarnock","v","Motherwell",null,null,null,"KIL","MOT",null,5,3]
[null,null,"2024-11-02","15:00:00","St Johnstone","v","Heart of Midlothian",null,null,null,"JOH","HEA",null,10,1]
[null,null,"2024-11-02","15:00:00","St Mirren","v","Ross County",null,null,null,"MIR","RCT",null,8,4]
[null,{"$f":"B27","v":"McRopod Concepts Sports System:     Scottish Premier League 2024/2025 (Pre-Split to Rd 33)"}]
[null,null,"2024-11-09","15:00:00","Aberdeen","v","Dundee",null,null,null,"ABD","DDE",null,11,7]
[null,null,"2024-11-09","15:00:00","Dundee United","v","Ross County",null,null,null,"DUT","RCT",null,6,4]
[null,null,"2024-11-09","15:00:00","Hibernian","v","St Mirren",null,null,null,"HIB","MIR",null,9,8]
[null,null,"2024-11-09","15:00:00","Kilmarnock","v","Celtic",null,null,null,"KIL","CEL",null,5,12]
[null,null,"2024-11-09","15:00:00","Motherwell","v","St Johnstone",null,null,null,"MOT","JOH",null,3,10]
[null,null,"2024-11-09","15:00:00","Rangers","v","Heart of Midlothian",null,null,null,"RAN","HEA",null,2,1]
[null,null,"2024-11-23","15:00:00","Dundee","v","Hibernian",null,null,null,"DDE","HIB",null,7,9]
[null,null,"2024-11-23","15:00:00","Heart of Midlothian","v","Celtic",null,null,null,"HEA","CEL",null,1,12]
[null,null,"2024-11-23","15:00:00","Rangers","v","Dundee United",null,null,null,"RAN","DUT",null,2,6]
[null,null,"2024-11-23","15:00:00","Ross County","v","Motherwell",null,null,null,"RCT","MOT",null,4,3]
[null,null,"2024-11-23","15:00:00","St Johnstone","v","Kilmarnock",null,null,null,"JOH","KIL",null,10,5]
[null,null,"2024-11-23","15:00:00","St Mirren","v","Aberdeen",null,null,null,"MIR","ABD",null,8,11]
[null,null,"2024-11-30","15:00:00","Celtic","v","Ross County",null,null,null,"CEL","RCT",null,12,4]
[null,null,"2024-11-30","15:00:00","Dundee United","v","St Mirren",null,null,null,"DUT","MIR",null,6,8]
[null,null,"2024-11-30","15:00:00","Heart of Midlothian","v","Aberdeen",null,null,null,"HEA","ABD",null,1,11]
[null,null,"2024-11-30","15:00:00","Kilmarnock","v","Dundee",null,null,null,"KIL","DDE",null,5,7]
[null,null,"2024-11-30","15:00:00","Motherwell","v","Hibernian",null,null,null,"MOT","HIB",null,3,9]
[null,null,"2024-11-30","15:00:00","St Johnstone","v","Rangers",null,null,null,"JOH","RAN",null,10,2]
[null,null,"2024-12-04","19:45:00","Aberdeen","v","Celtic",null,null,null,"ABD","CEL",null,11,12]
[null,null,"2024-12-04","19:45:00","Dundee","v","Motherwell",null,null,null,"DDE","MOT",null,7,3]
[null,null,"2024-12-04","19:45:00","Hibernian","v","Dundee United",null,null,null,"HIB","DUT",null,9,6]
[null,null,"2024-12-04","19:45:00","Rangers","v","Kilmarnock",null,null,null,"RAN","KIL",null,2,5]
[null,null,"2024-09-21","15:00:00","Ross County","v","St Johnstone",null,null,null,"RCT","JOH",null,4,10]
[null,null,"2024-09-21","15:00:00","St Mirren","v","Heart of Midlothian",null,null,null,"MIR","HEA",null,8,1]
[null,null,"2024-12-07","15:00:00","Aberdeen","v","St Johnstone",null,null,null,"ABD","JOH",null,11,10]
[null,null,"2024-12-07","15:00:00","Celtic","v","Hibernian",null,null,null,"CEL","HIB",null,12,9]
[null,null,"2024-12-07","15:00:00","Dundee United","v","Kilmarnock",null,null,null,"DUT","KIL",null,6,5]
[null,null,"2024-12-07","15:00:00","Heart of Midlothian","v","Dundee",null,null,null,"HEA","DDE",null,1,7]
[null,null,"2024-12-07","15:00:00","Ross County","v","Rangers",null,null,null,"RCT","RAN",null,4,2]
[null,null,"2024-12-07","15:00:00","St Mirren","v","Motherwell",null,null,null,"MIR","MOT",null,8,3]
[null,null,"2024-12-14","15:00:00","Dundee","v","Celtic",null,null,null,"DDE","CEL",null,7,12]
[null,null,"2024-12-14","15:00:00","Hibernian","v","Ross County",null,null,null,"HIB","RCT",null,9,4]
[null,null,"2024-12-14","15:00:00","Kilmarnock","v","Heart of Midlothian",null,null,null,"KIL","HEA",null,5,1]
[null,null,"2024-12-14","15:00:00","Motherwell","v","Dundee United",null,null,null,"MOT","DUT",null,3,6]
[null,null,"2024-12-14","15:00:00","Rangers","v","Aberdeen",null,null,null,"RAN","ABD",null,2,11]
[null,null,"2024-12-14","15:00:00","St Johnstone","v","St Mirren",null,null,null,"JOH","MIR",null,10,8]
[null,null,"2024-12-21","15:00:00","Aberdeen","v","Hibernian",null,null,null,"ABD","HIB",null,11,9]
[null,null,"2024-12-21","15:00:00","Dundee United","v","Celtic",null,null,null,"DUT","CEL",null,6,12]
[null,null,"2024-12-21","15:00:00","Heart of Midlothian","v","St Johnstone",null,null,null,"HEA","JOH",null,1,10]
[null,null,"2024-12-21","15:00:00","Motherwell","v","Kilmarnock",null,null,null,"MOT","KIL",null,3,5]
[null,null,"2024-12-21","15:00:00","Rangers","v","Dundee",null,null,null,"RAN","DDE",null,2,7]
[null,null,"2024-12-21","15:00:00","Ross County","v","St Mirren",null,null,null,"RCT","MIR",null,4,8]
[null,{"$f":"B27","v":"McRopod Concepts Sports System:     Scottish Premier League 2024/2025 (Pre-Split to Rd 33)"}]
[null,null,"2024-12-26","15:00:00","Celtic","v","Motherwell",null,null,null,"CEL","MOT",null,12,3]
[null,null,"2024-12-26","15:00:00","Dundee","v","Ross County",null,null,null,"DDE","RCT",null,7,4]
[null,null,"2024-12-26","12:30:00","Heart of Midlothian","v","Hibernian",null,null,null,"HEA","HIB",null,1,9]
[null,null,"2024-12-26","15:00:00","Kilmarnock","v","Aberdeen",null,null,null,"KIL","ABD",null,5,11]
[null,null,"2024-12-26","15:00:00","St Johnstone","v","Dundee United",null,null,null,"JOH","DUT",null,10,6]
[null,null,"2024-12-26","15:00:00","St Mirren","v","Rangers",null,null,null,"MIR","RAN",null,8,2]
[null,null,"2024-12-29","15:00:00","Celtic","v","St Johnstone",null,null,null,"CEL","JOH",null,12,10]
[null,null,"2024-12-29","15:00:00","Dundee United","v","Aberdeen",null,null,null,"DUT","ABD",null,6,11]
[null,null,"2024-12-29","15:00:00","Hibernian","v","Kilmarnock",null,null,null,"HIB","KIL",null,9,5]
[null,null,"2024-12-29","15:00:00","Motherwell","v","Rangers",null,null,null,"MOT","RAN",null,3,2]
[null,null,"2024-12-29","15:00:00","Ross County","v","Heart of Midlothian",null,null,null,"RCT","HEA",null,4,1]
[null,null,"2024-12-29","15:00:00","St Mirren","v","Dundee",null,null,null,"MIR","DDE",null,8,7]
[null,null,"2025-01-02","15:00:00","Aberdeen","v","Ross County",null,null,null,"ABD","RCT",null,11,4]
[null,null,"2025-01-02","17:30:00","Dundee","v","Dundee United",null,null,null,"DDE","DUT",null,7,6]
[null,null,"2025-01-02","15:00:00","Heart of Midlothian","v","Motherwell",null,null,null,"HEA","MOT",null,1,3]
[null,null,"2025-01-02","15:00:00","Kilmarnock","v","St Mirren",null,null,null,"KIL","MIR",null,5,8]
[null,null,"2025-01-02","15:00:00","Rangers","v","Celtic",null,null,null,"RAN","CEL",null,2,12]
[null,null,"2025-01-02","15:00:00","St Johnstone","v","Hibernian",null,null,null,"JOH","HIB",null,10,9]
[null,null,"2025-01-05","15:00:00","Celtic","v","St Mirren",null,null,null,"CEL","MIR",null,12,8]
[null,null,"2025-01-05","15:00:00","Dundee United","v","Heart of Midlothian",null,null,null,"DUT","HEA",null,6,1]
[null,null,"2025-01-05","15:00:00","Hibernian","v","Rangers",null,null,null,"HIB","RAN",null,9,2]
[null,null,"2025-01-05","15:00:00","Kilmarnock","v","Ross County",null,null,null,"KIL","RCT",null,5,4]
[null,null,"2025-01-05","15:00:00","Motherwell","v","Aberdeen",null,null,null,"MOT","ABD",null,3,11]
[null,null,"2025-01-05","15:00:00","St Johnstone","v","Dundee",null,null,null,"JOH","DDE",null,10,7]
[null,null,"2025-01-11","15:00:00","Aberdeen","v","Heart of Midlothian",null,null,null,"ABD","HEA",null,11,1]
[null,null,"2025-01-11","15:00:00","Dundee","v","Kilmarnock",null,null,null,"DDE","KIL",null,7,5]
[null,null,"2025-01-11","15:00:00","Hibernian","v","Motherwell",null,null,null,"HIB","MOT",null,9,3]
[null,null,"2025-01-11","15:00:00","Rangers","v","St Johnstone",null,null,null,"RAN","JOH",null,2,10]
[null,null,"2025-01-11","15:00:00","Ross County","v","Celtic",null,null,null,"RCT","CEL",null,4,12]
[null,null,"2025-01-11","15:00:00","St Mirren","v","Dundee United",null,null,null,"MIR","DUT",null,8,6]
[null,null,"2025-01-25","15:00:00","Aberdeen","v","St Mirren",null,null,null,"ABD","MIR",null,11,8]
[null,null,"2025-01-25","15:00:00","Celtic","v","Dundee",null,null,null,"CEL","DDE",null,12,7]
[null,null,"2025-01-25","15:00:00","Dundee United","v","Rangers",null,null,null,"DUT","RAN",null,6,2]
[null,null,"2025-01-25","15:00:00","Heart of Midlothian","v","Kilmarnock",null,null,null,"HEA","KIL",null,1,5]
[null,null,"2025-01-25","15:00:00","Ross County","v","Hibernian",null,null,null,"RCT","HIB",null,4,9]
[null,null,"2025-01-25","15:00:00","St Johnstone","v","Motherwell",null,null,null,"JOH","MOT",null,10,3]
[null,null,"2025-02-01","15:00:00","Dundee","v","Heart of Midlothian",null,null,null,"DDE","HEA",null,7,1]
[null,null,"2025-02-01","15:00:00","Hibernian","v","Aberdeen",null,null,null,"HIB","ABD",null,9,11]
[null,null,"2025-02-01","15:00:00","Kilmarnock","v","Dundee United",null,null,null,"KIL","DUT",null,5,6]
[null,null,"2025-02-01","15:00:00","Motherwell","v","Celtic",null,null,null,"MOT","CEL",null,3,12]
[null,null,"2025-02-01","15:00:00","Rangers","v","Ross County",null,null,null,"RAN","RCT",null,2,4]
[null,null,"2025-02-01","15:00:00","St Mirren","v","St Johnstone",null,null,null,"MIR","JOH",null,8,10]
[null,{"$f":"B27","v":"McRopod Concepts Sports System:     Scottish Premier League 2024/2025 (Pre-Split to Rd 33)"}]
[null,null,"2025-02-15","15:00:00","Celtic","v","Dundee United",null,null,null,"CEL","DUT",null,12,6]
[null,null,"2025-02-15","15:00:00","Dundee","v","Aberdeen",null,null,null,"DDE","ABD",null,7,11]
[null,null,"2025-02-15","15:00:00","Heart of Midlothian","v","Rangers",null,null,null,"HEA","RAN",null,1,2]
[null,null,"2025-02-15","15:00:00","Kilmarnock","v","St Johnstone",null,null,null,"KIL","JOH",null,5,10]
[null,null,"2025-02-15","15:00:00","Motherwell","v","Ross County",null,null,null,"MOT","RCT",null,3,4]
[null,null,"2025-02-15","15:00:00","St Mirren","v","Hibernian",null,null,null,"MIR","HIB",null,8,9]
[null,null,"2025-02-22","15:00:00","Aberdeen","v","Kilmarnock",null,null,null,"ABD","KIL",null,11,5]
[null,null,"2025-02-22","15:00:00","Dundee United","v","Motherwell",null,null,null,"DUT","MOT",null,6,3]
[null,null,"2025-02-22","15:00:00","Hibernian","v","Celtic",null,null,null,"HIB","CEL",null,9,12]
[null,null,"2025-02-22","15:00:00","Rangers","v","St Mirren",null,null,null,"RAN","MIR",null,2,8]
[null,null,"2025-02-22","15:00:00","Ross County","v","Dundee",null,null,null,"RCT","DDE",null,4,7]
[null,null,"2025-02-22","15:00:00","St Johnstone","v","Heart of Midlothian",null,null,null,"JOH","HEA",null,10,1]
[null,null,"2025-02-26","19:45:00","Celtic","v","Aberdeen",null,null,null,"CEL","ABD",null,12,11]
[null,null,"2025-02-26","19:45:00","Dundee United","v","Hibernian",null,null,null,"DUT","HIB",null,6,9]
[null,null,"2025-02-26","19:45:00","Heart of Midlothian","v","St Mirren",null,null,null,"HEA","MIR",null,1,8]
[null,null,"2025-02-26","19:45:00","Kilmarnock","v","Rangers",null,null,null,"KIL","RAN",null,5,2]
[null,null,"2025-02-26","19:45:00","Motherwell","v","Dundee",null,null,null,"MOT","DDE",null,3,7]
[null,null,"2025-02-26","19:45:00","St Johnstone","v","Ross County",null,null,null,"JOH","RCT",null,10,4]
[null,null,"2025-03-01","15:00:00","Aberdeen","v","Dundee United",null,null,null,"ABD","DUT",null,11,6]
[null,null,"2025-03-01","15:00:00","Dundee","v","St Johnstone",null,null,null,"DDE","JOH",null,7,10]
[null,null,"2025-03-01","15:00:00","Hibernian","v","Heart of Midlothian",null,null,null,"HIB","HEA",null,9,1]
[null,null,"2025-03-01","15:00:00","Rangers","v","Motherwell",null,null,null,"RAN","MOT",null,2,3]
[null,null,"2025-03-01","15:00:00","Ross County","v","Kilmarnock",null,null,null,"RCT","KIL",null,4,5]
[null,null,"2025-03-01","15:00:00","St Mirren","v","Celtic",null,null,null,"MIR","CEL",null,8,12]
[null,null,"2025-03-15","15:00:00","Celtic","v","Rangers",null,null,null,"CEL","RAN",null,12,2]
[null,null,"2025-03-15","15:00:00","Dundee United","v","Dundee",null,null,null,"DUT","DDE",null,6,7]
[null,null,"2025-03-15","15:00:00","Heart of Midlothian","v","Ross County",null,null,null,"HEA","RCT",null,1,4]
[null,null,"2025-03-15","15:00:00","Kilmarnock","v","Hibernian",null,null,null,"KIL","HIB",null,5,9]
[null,null,"2025-03-15","15:00:00","Motherwell","v","St Mirren",null,null,null,"MOT","MIR",null,3,8]
[null,null,"2025-03-15","15:00:00","St Johnstone","v","Aberdeen",null,null,null,"JOH","ABD",null,10,11]
[null,null,"2025-03-29","15:00:00","Aberdeen","v","Motherwell",null,null,null,"ABD","MOT",null,11,3]
[null,null,"2025-03-29","15:00:00","Celtic","v","Heart of Midlothian",null,null,null,"CEL","HEA",null,12,1]
[null,null,"2025-03-29","15:00:00","Dundee","v","Rangers",null,null,null,"DDE","RAN",null,7,2]
[null,null,"2025-03-29","15:00:00","Hibernian","v","St Johnstone",null,null,null,"HIB","JOH",null,9,10]
[null,null,"2025-03-29","15:00:00","Ross County","v","Dundee United",null,null,null,"RCT","DUT",null,4,6]
[null,null,"2025-03-29","15:00:00","St Mirren","v","Kilmarnock",null,null,null,"MIR","KIL",null,8,5]
[null,null,"2025-04-05","15:00:00","Dundee","v","St Mirren",null,null,null,"DDE","MIR",null,7,8]
[null,null,"2025-04-05","15:00:00","Heart of Midlothian","v","Dundee United",null,null,null,"HEA","DUT",null,1,6]
[null,null,"2025-04-05","15:00:00","Kilmarnock","v","Motherwell",null,null,null,"KIL","MOT",null,5,3]
[null,null,"2025-04-05","15:00:00","Rangers","v","Hibernian",null,null,null,"RAN","HIB",null,2,9]
[null,null,"2025-04-05","15:00:00","Ross County","v","Aberdeen",null,null,null,"RCT","ABD",null,4,11]
[null,null,"2025-04-05","15:00:00","St Johnstone","v","Celtic",null,null,null,"JOH","CEL",null,10,12]
[null,{"$f":"B156","v":"McRopod Concepts Sports System:     Scottish Premier League 2024/2025 (Pre-Split to Rd 33)"}]
[null,null,"2025-04-12","15:00:00","Aberdeen","v","Rangers",null,null,null,"ABD","RAN",null,11,2]
[null,null,"2025-04-12","15:00:00","Celtic","v","Kilmarnock",null,null,null,"CEL","KIL",null,12,5]
[null,null,"2025-04-12","15:00:00","Dundee United","v","St Johnstone",null,null,null,"DUT","JOH",null,6,10]
[null,null,"2025-04-12","15:00:00","Hibernian","v","Dundee",null,null,null,"HIB","DDE",null,9,7]
[null,null,"2025-04-12","15:00:00","Motherwell","v","Heart of Midlothian",null,null,null,"MOT","HEA",null,3,1]
[null,null,"2025-04-12","15:00:00","St Mirren","v","Ross County",null,null,null,"MIR","RCT",null,8,4]
[" ",null,"2024-04-27","15:00:00","Aberdeen","v"," Motherwell",null,null,null,"ABD","MOT",null,7,9]
[null,null,"2024-04-27","15:00:00","Kilmarnock","v"," Heart of Midlothian",null,null,null,"KIL","HEA",null,4,5]
[null,null,"2024-04-27","15:00:00","Livingston","v"," Ross County",null,null,null,"LIV","RCT",null,8,11]
[null,null,"2024-04-27","15:00:00","St Johnstone","v"," Hibernian",null,null,null,"STJ","HIB",null,6,3]
[null,null,"2024-04-28","12:30:00","St Mirren","v"," Rangers",null,null,null,"STM","SEV",null,1,2]
[null,null,"2024-04-28","15:00:00","Dundee","v"," Celtic",null,null,null,"DDE","CEL",null,10,12]
[null,null,"2024-05-04","15:00:00","Aberdeen","v"," St Johnstone",null,null,null,"ABD","STJ",null,7,6]
[null,null,"2024-05-04","15:00:00","Celtic","v"," Heart of Midlothian",null,null,null,"CEL","HEA",null,12,5]
[null,null,"2024-05-04","15:00:00","Dundee","v"," St Mirren",null,null,null,"DDE","STM",null,10,1]
[null,null,"2024-05-04","15:00:00","Motherwell","v"," Livingston",null,null,null,"MOT","LIV",null,9,8]
[null,null,"2024-05-04","15:00:00","Ross County","v"," Hibernian",null,null,null,"RCT","HIB",null,11,3]
[null,null,"2024-05-05","13:00:00","Rangers","v"," Kilmarnock",null,null,null,"SEV","KIL",null,2,4]
[null,null,"2024-05-11","12:30:00","Celtic","v"," Rangers",null,null,null,"CEL","SEV",null,12,2]
[null,null,"2024-05-11","15:00:00","Heart of Midlothian","v"," Dundee",null,null,null,"HEA","DDE",null,5,10]
[null,null,"2024-05-11","15:00:00","Livingston","v"," St Johnstone",null,null,null,"LIV","STJ",null,8,6]
[null,null,"2024-05-11","15:00:00","Ross County","v"," Motherwell",null,null,null,"RCT","MOT",null,11,9]
[null,null,"2024-05-11","15:00:00","St Mirren","v"," Kilmarnock",null,null,null,"STM","KIL",null,1,4]
[null,null,"2024-05-12","15:00:00","Hibernian","v"," Aberdeen",null,null,null,"HIB","ABD",null,3,7]
[null,null,"2024-05-14","19:30:00","Rangers","v"," Dundee",null,null,null,"SEV","DDE",null,2,10]
[null,null,"2024-05-15","19:30:00","Kilmarnock","v"," Celtic ",null,null,null,"KIL","CEL",null,4,12]
[null,null,"2024-05-15","19:45:00","Aberdeen","v"," Livingston",null,null,null,"ABD","LIV",null,7,8]
[null,null,"2024-05-15","19:45:00","Hibernian","v"," Motherwell",null,null,null,"HIB","MOT",null,3,9]
[null,null,"2024-05-15","19:45:00","St Johnstone","v"," Ross County",null,null,null,"STJ","RCT",null,6,11]
[null,null,"2024-05-15","19:45:00","St Mirren","v"," Heart of Midlothian",null,null,null,"STM","HEA",null,1,5]
[null,null,"2024-05-18","12:30:00","Celtic","v"," St Mirren",null,null,null,"CEL","STM",null,12,1]
[null,null,"2024-05-18","12:30:00","Dundee","v"," Kilmarnock",null,null,null,"DDE","KIL",null,10,4]
[null,null,"2024-05-18","12:30:00","Heart of Midlothian","v"," Rangers",null,null,null,"HEA","SEV",null,5,2]
[null,null,"2024-05-19","15:00:00","Livingston","v"," Hibernian",null,null,null,"LIV","HIB",null,8,3]
[null,null,"2024-05-19","15:00:00","Motherwell","v"," St Johnstone",null,null,null,"MOT","STJ",null,9,6]
[null,null,"2024-05-19","15:00:00","Ross County","v"," Aberdeen",null,null,null,"RCT","ABD",null,11,7]
[null,{"$f":"B199","v":"McRopod Concepts Sports System:     Scottish Premier League 2024/2025 (Pre-Split to Rd 33)"}]

{"sheet":"Grid","index":2,"n_rows":114,"n_cols":56,"rows_kept":114,"cut":false,"hidden":true,"merged":[]}
[{"$f":"IF(AV14=396,\"Final Ladder - Pre-Split\",IF(AV87=456,\"Final Ladder - Season\",\"(Season Incomplete)\"))","v":"(Season Incomplete)"},null,{"$f":"A2","v":"Heart of Midlothian"},null,null,{"$f":"A3","v":"Motherwell"},null,null,{"$f":"A4","v":"Celtic"},null,null,{"$f":"A5","v":"Dundee United"},null,null,{"$f":"A6","v":"St Mirren"},null,null,{"$f":"A7","v":"St Johnstone"},null,null,{"$f":"A8","v":"Rangers"},null,null,{"$f":"A9","v":"Ross County"},null,null,{"$f":"A10","v":"Kilmarnock"},null,null,{"$f":"A11","v":"Dundee"},null,null,{"$f":"A12","v":"Hibernian"},null,null,{"$f":"A13","v":"Aberdeen"},null,"HW","HD","HL","HF","HA","AW","AD","AL","AF","AA","P","W","D","L","F","A","Pts","G/D","Ddn"]
[{"$f":"Fixtures!E3","v":"Heart of Midlothian"},null,null,{"$f":"IF(C2=\"\",\"\",IF(B2>C2,\"W\",IF(B2=C2,\"D\",IF(B2<C2,\"L\"))))","v":""},{"$f":"IF(Fixtures!$H$128=\"\",\"\",Fixtures!$H$128)","v":""},{"$f":"IF(Fixtures!$I$128=\"\",\"\",Fixtures!$I$128)","v":""},{"$f":"IF(F2=\"\",\"\",IF(E2>F2,\"W\",IF(E2=F2,\"D\",IF(E2<F2,\"L\"))))","v":""},{"$f":"IF(Fixtures!$H$78=\"\",\"\",Fixtures!$H$78)","v":""},{"$f":"IF(Fixtures!$I$78=\"\",\"\",Fixtures!$I$78)","v":""},{"$f":"IF(I2=\"\",\"\",IF(H2>I2,\"W\",IF(H2=I2,\"D\",IF(H2<I2,\"L\"))))","v":""},{"$f":"IF(Fixtures!$H$23=\"\",\"\",Fixtures!$H$23)","v":0},{"$f":"IF(Fixtures!$I$23=\"\",\"\",Fixtures!$I$23)","v":1},{"$f":"IF(L2=\"\",\"\",IF(K2>L2,\"W\",IF(K2=L2,\"D\",IF(K2<L2,\"L\"))))","v":"L"},{"$f":"IF(Fixtures!$H$48=\"\",\"\",Fixtures!$H$48)","v":""},{"$f":"IF(Fixtures!$I$48=\"\",\"\",Fixtures!$I$48)","v":""},{"$f":"IF(O2=\"\",\"\",IF(N2>O2,\"W\",IF(N2=O2,\"D\",IF(N2<O2,\"L\"))))","v":""},{"$f":"IF(Fixtures!$H$109=\"\",\"\",Fixtures!$H$109)","v":""},{"$f":"IF(Fixtures!$I$109=\"\",\"\",Fixtures!$I$109)","v":""},{"$f":"IF(R2=\"\",\"\",IF(Q2>R2,\"W\",IF(Q2=R2,\"D\",IF(Q2<R2,\"L\"))))","v":""},{"$f":"IF(Fixtures!$H$3=\"\",\"\",Fixtures!$H$3)","v":0},{"$f":"IF(Fixtures!$I$3=\"\",\"\",Fixtures!$I$3)","v":0},{"$f":"IF(U2=\"\",\"\",IF(T2>U2,\"W\",IF(T2=U2,\"D\",IF(T2<U2,\"L\"))))","v":"D"},{"$f":"IF(Fixtures!$H$35=\"\",\"\",Fixtures!$H$35)","v":""},{"$f":"IF(Fixtures!$I$35=\"\",\"\",Fixtures!$I$35)","v":""},{"$f":"IF(X2=\"\",\"\",IF(W2>X2,\"W\",IF(W2=X2,\"D\",IF(W2<X2,\"L\"))))","v":""},{"$f":"IF(Fixtures!$H$61=\"\",\"\",Fixtures!$H$61)","v":""},{"$f":"IF(Fixtures!$I$61=\"\",\"\",Fixtures!$I$61)","v":""},{"$f":"IF(AA2=\"\",\"\",IF(Z2>AA2,\"W\",IF(Z2=AA2,\"D\",IF(Z2<AA2,\"L\"))))","v":""},{"$f":"IF(Fixtures!$H$98=\"\",\"\",Fixtures!$H$98)","v":""},{"$f":"IF(Fixtures!$I$98=\"\",\"\",Fixtures!$I$98)","v":""},{"$f":"IF(AD2=\"\",\"\",IF(AC2>AD2,\"W\",IF(AC2=AD2,\"D\",IF(AC2<AD2,\"L\"))))","v":""},{"$f":"IF(Fixtures!$H$116=\"\",\"\",Fixtures!$H$116)","v":""},{"$f":"IF(Fixtures!$I$116=\"\",\"\",Fixtures!$I$116)","v":""},{"$f":"IF(AG2=\"\",\"\",IF(AF2>AG2,\"W\",IF(AF2=AG2,\"D\",IF(AF2<AG2,\"L\"))))","v":""},{"$f":"IF(Fixtures!$H$85=\"\",\"\",Fixtures!$H$85)","v":""},{"$f":"IF(Fixtures!$I$85=\"\",\"\",Fixtures!$I$85)","v":""},{"$f":"IF(AJ2=\"\",\"\",IF(AI2>AJ2,\"W\",IF(AI2=AJ2,\"D\",IF(AI2<AJ2,\"L\"))))","v":""},{"$f":"IF(D2=\"W\",1,0)+IF(G2=\"W\",1,0)+IF(J2=\"W\",1,0)+IF(M2=\"W\",1,0)+IF(P2=\"W\",1,0)+IF(S2=\"W\",1,0)+IF(V2=\"W\",1,0)+IF(Y2=\"W\",1,0)+IF(AB2=\"W\",1,0)+IF(AE2=\"W\",1,0)+IF(AH2=\"W\",1,0)+IF(AK2=\"W\",1,0)","v":0},{"$f":"IF(D2=\"D\",1,0)+IF(G2=\"D\",1,0)+IF(J2=\"D\",1,0)+IF(M2=\"D\",1,0)+IF(P2=\"D\",1,0)+IF(S2=\"D\",1,0)+IF(V2=\"D\",1,0)+IF(Y2=\"D\",1,0)+IF(AB2=\"D\",1,0)+IF(AE2=\"D\",1,0)+IF(AH2=\"D\",1,0)+IF(AK2=\"D\",1,0)","v":1},{"$f":"IF(D2=\"L\",1,0)+IF(G2=\"L\",1,0)+IF(J2=\"L\",1,0)+IF(M2=\"L\",1,0)+IF(P2=\"L\",1,0)+IF(S2=\"L\",1,0)+IF(V2=\"L\",1,0)+IF(Y2=\"L\",1,0)+IF(AB2=\"L\",1,0)+IF(AE2=\"L\",1,0)+IF(AH2=\"L\",1,0)+IF(AK2=\"L\",1,0)","v":1},{"$f":"(IF(B2=\"\",0,B2))+(IF(E2=\"\",0,E2))+(IF(H2=\"\",0,H2))+(IF(K2=\"\",0,K2))+(IF(N2=\"\",0,N2))+(IF(Q2=\"\",0,Q2))+(IF(T2=\"\",0,T2))+(IF(W2=\"\",0,W2))+(IF(Z2=\"\",0,Z2))+(IF(AC2=\"\",0,AC2))+(IF(AF2=\"\",0,AF2))+(IF(AI2=\"\",0,AI2))","v":0},{"$f":"(IF(C2=\"\",0,C2))+(IF(F2=\"\",0,F2))+(IF(I2=\"\",0,I2))+(IF(L2=\"\",0,L2))+(IF(O2=\"\",0,O2))+(IF(R2=\"\",0,R2))+(IF(U2=\"\",0,U2))+(IF(X2=\"\",0,X2))+(IF(AA2=\"\",0,AA2))+(IF(AD2=\"\",0,AD2))+(IF(AG2=\"\",0,AG2))+(IF(AJ2=\"\",0,AJ2))","v":1},{"$f":"B14","v":0},{"$f":"C14","v":0},{"$f":"D14","v":2},{"$f":"B16","v":2},{"$f":"C16","v":6},{"$f":"SUM(AW2:AY2)","v":4},{"$f":"AQ2+AL2+AW44","v":0},{"$f":"AR2+AM2+AX44","v":1},{"$f":"AS2+AN2+AY44","v":3},{"$f":"AT2+AO2+AZ44","v":2},{"$f":"AU2+AP2+BA44","v":7},{"$f":"AW2*3+AX2-BD2","v":1},{"$f":"AZ2-BA2","v":-5},0]
[{"$f":"Fixtures!E4","v":"Motherwell"},{"$f":"IF(Fixtures!$H$18=\"\",\"\",Fixtures!$H$18)","v":3},{"$f":"IF(Fixtures!$I$18=\"\",\"\",Fixtures!$I$18)","v":1},{"$f":"IF(C3=\"\",\"\",IF(B3>C3,\"W\",IF(B3=C3,\"D\",IF(B3<C3,\"L\"))))","v":"W"},null,null,{"$f":"IF(F3=\"\",\"\",IF(E3>F3,\"W\",IF(E3=F3,\"D\",IF(E3<F3,\"L\"))))","v":""},{"$f":"IF(Fixtures!$H$55=\"\",\"\",Fixtures!$H$55)","v":""},{"$f":"IF(Fixtures!$I$55=\"\",\"\",Fixtures!$I$55)","v":""},{"$f":"IF(I3=\"\",\"\",IF(H3>I3,\"W\",IF(H3=I3,\"D\",IF(H3<I3,\"L\"))))","v":""},{"$f":"IF(Fixtures!$H$104=\"\",\"\",Fixtures!$H$104)","v":""},{"$f":"IF(Fixtures!$I$104=\"\",\"\",Fixtures!$I$104)","v":""},{"$f":"IF(L3=\"\",\"\",IF(K3>L3,\"W\",IF(K3=L3,\"D\",IF(K3<L3,\"L\"))))","v":""},{"$f":"IF(Fixtures!$H$37=\"\",\"\",Fixtures!$H$37)","v":""},{"$f":"IF(Fixtures!$I$37=\"\",\"\",Fixtures!$I$37)","v":""},{"$f":"IF(O3=\"\",\"\",IF(N3>O3,\"W\",IF(N3=O3,\"D\",IF(N3<O3,\"L\"))))","v":""},{"$f":"IF(Fixtures!$H$75=\"\",\"\",Fixtures!$H$75)","v":""},{"$f":"IF(Fixtures!$I$75=\"\",\"\",Fixtures!$I$75)","v":""},{"$f":"IF(R3=\"\",\"\",IF(Q3>R3,\"W\",IF(Q3=R3,\"D\",IF(Q3<R3,\"L\"))))","v":""},{"$f":"IF(Fixtures!$H$123=\"\",\"\",Fixtures!$H$123)","v":""},{"$f":"IF(Fixtures!$I$123=\"\",\"\",Fixtures!$I$123)","v":""},{"$f":"IF(U3=\"\",\"\",IF(T3>U3,\"W\",IF(T3=U3,\"D\",IF(T3<U3,\"L\"))))","v":""},{"$f":"IF(Fixtures!$H$4=\"\",\"\",Fixtures!$H$4)","v":0},{"$f":"IF(Fixtures!$I$4=\"\",\"\",Fixtures!$I$4)","v":0},{"$f":"IF(X3=\"\",\"\",IF(W3>X3,\"W\",IF(W3=X3,\"D\",IF(W3<X3,\"L\"))))","v":"D"},{"$f":"IF(Fixtures!$H$110=\"\",\"\",Fixtures!$H$110)","v":""},{"$f":"IF(Fixtures!$I$110=\"\",\"\",Fixtures!$I$110)","v":""},{"$f":"IF(AA3=\"\",\"\",IF(Z3>AA3,\"W\",IF(Z3=AA3,\"D\",IF(Z3<AA3,\"L\"))))","v":""},{"$f":"IF(Fixtures!$H$50=\"\",\"\",Fixtures!$H$50)","v":""},{"$f":"IF(Fixtures!$I$50=\"\",\"\",Fixtures!$I$50)","v":""},{"$f":"IF(AD3=\"\",\"\",IF(AC3>AD3,\"W\",IF(AC3=AD3,\"D\",IF(AC3<AD3,\"L\"))))","v":""},{"$f":"IF(Fixtures!$H$87=\"\",\"\",Fixtures!$H$87)","v":""},{"$f":"IF(Fixtures!$I$87=\"\",\"\",Fixtures!$I$87)","v":""},{"$f":"IF(AG3=\"\",\"\",IF(AF3>AG3,\"W\",IF(AF3=AG3,\"D\",IF(AF3<AG3,\"L\"))))","v":""},{"$f":"IF(Fixtures!$H$136=\"\",\"\",Fixtures!$H$136)","v":""},{"$f":"IF(Fixtures!$I$136=\"\",\"\",Fixtures!$I$136)","v":""},{"$f":"IF(AJ3=\"\",\"\",IF(AI3>AJ3,\"W\",IF(AI3=AJ3,\"D\",IF(AI3<AJ3,\"L\"))))","v":""},{"$f":"IF(D3=\"W\",1,0)+IF(G3=\"W\",1,0)+IF(J3=\"W\",1,0)+IF(M3=\"W\",1,0)+IF(P3=\"W\",1,0)+IF(S3=\"W\",1,0)+IF(V3=\"W\",1,0)+IF(Y3=\"W\",1,0)+IF(AB3=\"W\",1,0)+IF(AE3=\"W\",1,0)+IF(AH3=\"W\",1,0)+IF(AK3=\"W\",1,0)","v":1},{"$f":"IF(D3=\"D\",1,0)+IF(G3=\"D\",1,0)+IF(J3=\"D\",1,0)+IF(M3=\"D\",1,0)+IF(P3=\"D\",1,0)+IF(S3=\"D\",1,0)+IF(V3=\"D\",1,0)+IF(Y3=\"D\",1,0)+IF(AB3=\"D\",1,0)+IF(AE3=\"D\",1,0)+IF(AH3=\"D\",1,0)+IF(AK3=\"D\",1,0)","v":1},{"$f":"IF(D3=\"L\",1,0)+IF(G3=\"L\",1,0)+IF(J3=\"L\",1,0)+IF(M3=\"L\",1,0)+IF(P3=\"L\",1,0)+IF(S3=\"L\",1,0)+IF(V3=\"L\",1,0)+IF(Y3=\"L\",1,0)+IF(AB3=\"L\",1,0)+IF(AE3=\"L\",1,0)+IF(AH3=\"L\",1,0)+IF(AK3=\"L\",1,0)","v":0},{"$f":"(IF(B3=\"\",0,B3))+(IF(E3=\"\",0,E3))+(IF(H3=\"\",0,H3))+(IF(K3=\"\",0,K3))+(IF(N3=\"\",0,N3))+(IF(Q3=\"\",0,Q3))+(IF(T3=\"\",0,T3))+(IF(W3=\"\",0,W3))+(IF(Z3=\"\",0,Z3))+(IF(AC3=\"\",0,AC3))+(IF(AF3=\"\",0,AF3))+(IF(AI3=\"\",0,AI3))","v":3},1,{"$f":"E14","v":1},{"$f":"F14","v":0},{"$f":"G14","v":1},{"$f":"E16","v":3},{"$f":"F16","v":3},{"$f":"SUM(AW3:AY3)","v":4},{"$f":"AQ3+AL3+AW45","v":2},{"$f":"AR3+AM3+AX45","v":1},{"$f":"AS3+AN3+AY45","v":1},6,{"$f":"AU3+AP3+BA45","v":4},{"$f":"AW3*3+AX3-BD3","v":7},2,0]
[{"$f":"Fixtures!E5","v":"Celtic"},{"$f":"IF(Fixtures!$H$29=\"\",\"\",Fixtures!$H$29)","v":""},{"$f":"IF(Fixtures!$I$29=\"\",\"\",Fixtures!$I$29)","v":""},{"$f":"IF(C4=\"\",\"\",IF(B4>C4,\"W\",IF(B4=C4,\"D\",IF(B4<C4,\"L\"))))","v":""},{"$f":"IF(Fixtures!$H$114=\"\",\"\",Fixtures!$H$114)","v":""},{"$f":"IF(Fixtures!$I$114=\"\",\"\",Fixtures!$I$114)","v":""},{"$f":"IF(F4=\"\",\"\",IF(E4>F4,\"W\",IF(E4=F4,\"D\",IF(E4<F4,\"L\"))))","v":""},null,null,{"$f":"IF(I4=\"\",\"\",IF(H4>I4,\"W\",IF(H4=I4,\"D\",IF(H4<I4,\"L\"))))","v":""},{"$f":"IF(Fixtures!$H$64=\"\",\"\",Fixtures!$H$64)","v":""},{"$f":"IF(Fixtures!$I$64=\"\",\"\",Fixtures!$I$64)","v":""},{"$f":"IF(L4=\"\",\"\",IF(K4>L4,\"W\",IF(K4=L4,\"D\",IF(K4<L4,\"L\"))))","v":""},{"$f":"IF(Fixtures!$H$132=\"\",\"\",Fixtures!$H$132)","v":""},{"$f":"IF(Fixtures!$I$132=\"\",\"\",Fixtures!$I$132)","v":""},{"$f":"IF(O4=\"\",\"\",IF(N4>O4,\"W\",IF(N4=O4,\"D\",IF(N4<O4,\"L\"))))","v":""},{"$f":"IF(Fixtures!$H$120=\"\",\"\",Fixtures!$H$120)","v":""},{"$f":"IF(Fixtures!$I$120=\"\",\"\",Fixtures!$I$120)","v":""},{"$f":"IF(R4=\"\",\"\",IF(Q4>R4,\"W\",IF(Q4=R4,\"D\",IF(Q4<R4,\"L\"))))","v":""},{"$f":"IF(Fixtures!$H$21=\"\",\"\",Fixtures!$H$21)","v":3},{"$f":"IF(Fixtures!$I$21=\"\",\"\",Fixtures!$I$21)","v":0},{"$f":"IF(U4=\"\",\"\",IF(T4>U4,\"W\",IF(T4=U4,\"D\",IF(T4<U4,\"L\"))))","v":"W"},{"$f":"IF(Fixtures!$H$83=\"\",\"\",Fixtures!$H$83)","v":""},{"$f":"IF(Fixtures!$I$83=\"\",\"\",Fixtures!$I$83)","v":""},{"$f":"IF(X4=\"\",\"\",IF(W4>X4,\"W\",IF(W4=X4,\"D\",IF(W4<X4,\"L\"))))","v":""},{"$f":"IF(Fixtures!$H$5=\"\",\"\",Fixtures!$H$5)","v":4},{"$f":"IF(Fixtures!$I$5=\"\",\"\",Fixtures!$I$5)","v":0},{"$f":"IF(AA4=\"\",\"\",IF(Z4>AA4,\"W\",IF(Z4=AA4,\"D\",IF(Z4<AA4,\"L\"))))","v":"W"},{"$f":"IF(Fixtures!$H$59=\"\",\"\",Fixtures!$H$59)","v":""},{"$f":"IF(Fixtures!$I$59=\"\",\"\",Fixtures!$I$59)","v":""},{"$f":"IF(AD4=\"\",\"\",IF(AC4>AD4,\"W\",IF(AC4=AD4,\"D\",IF(AC4<AD4,\"L\"))))","v":""},{"$f":"IF(Fixtures!$H$96=\"\",\"\",Fixtures!$H$96)","v":""},{"$f":"IF(Fixtures!$I$96=\"\",\"\",Fixtures!$I$96)","v":""},{"$f":"IF(AG4=\"\",\"\",IF(AF4>AG4,\"W\",IF(AF4=AG4,\"D\",IF(AF4<AG4,\"L\"))))","v":""},{"$f":"IF(Fixtures!$H$46=\"\",\"\",Fixtures!$H$46)","v":""},{"$f":"IF(Fixtures!$I$46=\"\",\"\",Fixtures!$I$46)","v":""},"",2,0,0,7,0,{"$f":"H14","v":2},{"$f":"I14","v":0},{"$f":"J14","v":0},{"$f":"H16","v":5},{"$f":"I16","v":0},4,4,0,{"$f":"AS4+AN4+AY46","v":0},12,0,12,12,0]
[{"$f":"Fixtures!E6","v":"Dundee United"},{"$f":"IF(Fixtures!$H$133=\"\",\"\",Fixtures!$H$133)","v":""},{"$f":"IF(Fixtures!$I$133=\"\",\"\",Fixtures!$I$133)","v":""},"",{"$f":"IF(Fixtures!$H$60=\"\",\"\",Fixtures!$H$60)","v":""},{"$f":"IF(Fixtures!$I$60=\"\",\"\",Fixtures!$I$60)","v":""},"",{"$f":"IF(Fixtures!$H$108=\"\",\"\",Fixtures!$H$108)","v":""},{"$f":"IF(Fixtures!$I$108=\"\",\"\",Fixtures!$I$108)","v":""},"",null,null,"",{"$f":"IF(Fixtures!$H$84=\"\",\"\",Fixtures!$H$84)","v":""},{"$f":"IF(Fixtures!$I$84=\"\",\"\",Fixtures!$I$84)","v":""},"",{"$f":"IF(Fixtures!$H$16=\"\",\"\",Fixtures!$H$16)","v":2},{"$f":"IF(Fixtures!$I$16=\"\",\"\",Fixtures!$I$16)","v":0},"W",{"$f":"IF(Fixtures!$H$30=\"\",\"\",Fixtures!$H$30)","v":""},{"$f":"IF(Fixtures!$I$30=\"\",\"\",Fixtures!$I$30)","v":""},"",{"$f":"IF(Fixtures!$H$72=\"\",\"\",Fixtures!$H$72)","v":""},{"$f":"IF(Fixtures!$I$72=\"\",\"\",Fixtures!$I$72)","v":""},"",{"$f":"IF(Fixtures!$H$97=\"\",\"\",Fixtures!$H$97)","v":""},{"$f":"IF(Fixtures!$I$97=\"\",\"\",Fixtures!$I$97)","v":""},"",{"$f":"IF(Fixtures!$H$6=\"\",\"\",Fixtures!$H$6)","v":2},{"$f":"IF(Fixtures!$I$6=\"\",\"\",Fixtures!$I$6)","v":2},"D",{"$f":"IF(Fixtures!$H$47=\"\",\"\",Fixtures!$H$47)","v":""},{"$f":"IF(Fixtures!$I$47=\"\",\"\",Fixtures!$I$47)","v":""},"",{"$f":"IF(Fixtures!$H$121=\"\",\"\",Fixtures!$H$121)","v":""},{"$f":"IF(Fixtures!$I$121=\"\",\"\",Fixtures!$I$121)","v":""},"",1,1,0,4,2,{"$f":"K14","v":1},{"$f":"L14","v":1},{"$f":"M14","v":0},{"$f":"K16","v":2},{"$f":"L16","v":1},4,2,2,0,6,3,8,3,0]
[{"$f":"Fixtures!E7","v":"St Mirren"},{"$f":"IF(Fixtures!$H$94=\"\",\"\",Fixtures!$H$94)","v":""},{"$f":"IF(Fixtures!$I$94=\"\",\"\",Fixtures!$I$94)","v":""},"",{"$f":"IF(Fixtures!$H$100=\"\",\"\",Fixtures!$H$100)","v":""},{"$f":"IF(Fixtures!$I$100=\"\",\"\",Fixtures!$I$100)","v":""},"",{"$f":"IF(Fixtures!$H$20=\"\",\"\",Fixtures!$H$20)","v":0},{"$f":"IF(Fixtures!$I$20=\"\",\"\",Fixtures!$I$20)","v":3},"L",{"$f":"IF(Fixtures!$H$45=\"\",\"\",Fixtures!$H$45)","v":""},{"$f":"IF(Fixtures!$I$45=\"\",\"\",Fixtures!$I$45)","v":""},"",null,null,"",{"$f":"IF(Fixtures!$H$63=\"\",\"\",Fixtures!$H$63)","v":""},{"$f":"IF(Fixtures!$I$63=\"\",\"\",Fixtures!$I$63)","v":""},"",{"$f":"IF(Fixtures!$H$119=\"\",\"\",Fixtures!$H$119)","v":""},{"$f":"IF(Fixtures!$I$119=\"\",\"\",Fixtures!$I$119)","v":""},"",{"$f":"IF(Fixtures!$H$69=\"\",\"\",Fixtures!$H$69)","v":""},{"$f":"IF(Fixtures!$I$69=\"\",\"\",Fixtures!$I$69)","v":""},"",{"$f":"IF(Fixtures!$H$33=\"\",\"\",Fixtures!$H$33)","v":""},{"$f":"IF(Fixtures!$I$33=\"\",\"\",Fixtures!$I$33)","v":""},"",{"$f":"IF(Fixtures!$H$125=\"\",\"\",Fixtures!$H$125)","v":""},{"$f":"IF(Fixtures!$I$125=\"\",\"\",Fixtures!$I$125)","v":""},"",{"$f":"IF(Fixtures!$H$7=\"\",\"\",Fixtures!$H$7)","v":3},{"$f":"IF(Fixtures!$I$7=\"\",\"\",Fixtures!$I$7)","v":0},"W",{"$f":"IF(Fixtures!$H$82=\"\",\"\",Fixtures!$H$82)","v":""},{"$f":"IF(Fixtures!$I$82=\"\",\"\",Fixtures!$I$82)","v":""},"",1,0,1,3,3,{"$f":"N14","v":0},{"$f":"O14","v":1},{"$f":"P14","v":1},{"$f":"N16","v":3},{"$f":"O16","v":5},4,1,1,2,6,8,4,-2,0]
[{"$f":"Fixtures!E8","v":"St Johnstone"},{"$f":"IF(Fixtures!$H$68=\"\",\"\",Fixtures!$H$68)","v":""},{"$f":"IF(Fixtures!$I$68=\"\",\"\",Fixtures!$I$68)","v":""},"",{"$f":"IF(Fixtures!$H$26=\"\",\"\",Fixtures!$H$26)","v":1},{"$f":"IF(Fixtures!$I$26=\"\",\"\",Fixtures!$I$26)","v":2},"L",{"$f":"IF(Fixtures!$H$39=\"\",\"\",Fixtures!$H$39)","v":""},{"$f":"IF(Fixtures!$I$39=\"\",\"\",Fixtures!$I$39)","v":""},"",{"$f":"IF(Fixtures!$H$118=\"\",\"\",Fixtures!$H$118)","v":""},{"$f":"IF(Fixtures!$I$118=\"\",\"\",Fixtures!$I$118)","v":""},"",{"$f":"IF(Fixtures!$H$106=\"\",\"\",Fixtures!$H$106)","v":""},{"$f":"IF(Fixtures!$I$106=\"\",\"\",Fixtures!$I$106)","v":""},"",null,null,"",{"$f":"IF(Fixtures!$H$88=\"\",\"\",Fixtures!$H$88)","v":""},{"$f":"IF(Fixtures!$I$88=\"\",\"\",Fixtures!$I$88)","v":""},"",{"$f":"IF(Fixtures!$H$51=\"\",\"\",Fixtures!$H$51)","v":""},{"$f":"IF(Fixtures!$I$51=\"\",\"\",Fixtures!$I$51)","v":""},"",{"$f":"IF(Fixtures!$H$81=\"\",\"\",Fixtures!$H$81)","v":""},{"$f":"IF(Fixtures!$I$81=\"\",\"\",Fixtures!$I$81)","v":""},"",{"$f":"IF(Fixtures!$H$137=\"\",\"\",Fixtures!$H$137)","v":""},{"$f":"IF(Fixtures!$I$137=\"\",\"\",Fixtures!$I$137)","v":""},"",{"$f":"IF(Fixtures!$H$131=\"\",\"\",Fixtures!$H$131)","v":""},{"$f":"IF(Fixtures!$I$131=\"\",\"\",Fixtures!$I$131)","v":""},"",{"$f":"IF(Fixtures!$H$8=\"\",\"\",Fixtures!$H$8)","v":1},{"$f":"IF(Fixtures!$I$8=\"\",\"\",Fixtures!$I$8)","v":2},"L",0,0,2,2,4,{"$f":"Q14","v":1},{"$f":"R14","v":0},{"$f":"S14","v":1},{"$f":"Q16","v":3},{"$f":"R16","v":2},4,1,0,3,5,6,3,-1,0]
[{"$f":"Fixtures!G3","v":"Rangers"},{"$f":"IF(Fixtures!$H$76=\"\",\"\",Fixtures!$H$76)","v":""},{"$f":"IF(Fixtures!$I$76=\"\",\"\",Fixtures!$I$76)","v":""},"",{"$f":"IF(Fixtures!$H$12=\"\",\"\",Fixtures!$H$12)","v":2},{"$f":"IF(Fixtures!$I$12=\"\",\"\",Fixtures!$I$12)","v":1},"W",{"$f":"IF(Fixtures!$H$130=\"\",\"\",Fixtures!$H$130)","v":""},{"$f":"IF(Fixtures!$I$130=\"\",\"\",Fixtures!$I$130)","v":""},"",{"$f":"IF(Fixtures!$H$79=\"\",\"\",Fixtures!$H$79)","v":""},{"$f":"IF(Fixtures!$I$79=\"\",\"\",Fixtures!$I$79)","v":""},"",{"$f":"IF(Fixtures!$H$56=\"\",\"\",Fixtures!$H$56)","v":""},{"$f":"IF(Fixtures!$I$56=\"\",\"\",Fixtures!$I$56)","v":""},"",{"$f":"IF(Fixtures!$H$43=\"\",\"\",Fixtures!$H$43)","v":""},{"$f":"IF(Fixtures!$I$43=\"\",\"\",Fixtures!$I$43)","v":""},"",null,null,"",{"$f":"IF(Fixtures!$H$19=\"\",\"\",Fixtures!$H$19)","v":6},{"$f":"IF(Fixtures!$I$19=\"\",\"\",Fixtures!$I$19)","v":0},"W",{"$f":"IF(Fixtures!$H$92=\"\",\"\",Fixtures!$H$92)","v":""},{"$f":"IF(Fixtures!$I$92=\"\",\"\",Fixtures!$I$92)","v":""},"",{"$f":"IF(Fixtures!$H$111=\"\",\"\",Fixtures!$H$111)","v":""},{"$f":"IF(Fixtures!$I$111=\"\",\"\",Fixtures!$I$111)","v":""},"",{"$f":"IF(Fixtures!$H$38=\"\",\"\",Fixtures!$H$38)","v":""},{"$f":"IF(Fixtures!$I$38=\"\",\"\",Fixtures!$I$38)","v":""},"",{"$f":"IF(Fixtures!$H$105=\"\",\"\",Fixtures!$H$105)","v":""},{"$f":"IF(Fixtures!$I$105=\"\",\"\",Fixtures!$I$105)","v":""},"",2,0,0,8,1,{"$f":"T14","v":0},{"$f":"U14","v":1},{"$f":"V14","v":1},{"$f":"T16","v":0},{"$f":"U16","v":3},4,2,1,1,8,4,7,4,0]
[{"$f":"Fixtures!G4","v":"Ross County"},{"$f":"IF(Fixtures!$H$124=\"\",\"\",Fixtures!$H$124)","v":""},{"$f":"IF(Fixtures!$I$124=\"\",\"\",Fixtures!$I$124)","v":""},"",{"$f":"IF(Fixtures!$H$80=\"\",\"\",Fixtures!$H$80)","v":""},{"$f":"IF(Fixtures!$I$80=\"\",\"\",Fixtures!$I$80)","v":""},"",{"$f":"IF(Fixtures!$H$44=\"\",\"\",Fixtures!$H$44)","v":""},{"$f":"IF(Fixtures!$I$44=\"\",\"\",Fixtures!$I$44)","v":""},"",{"$f":"IF(Fixtures!$H$13=\"\",\"\",Fixtures!$H$13)","v":1},{"$f":"IF(Fixtures!$I$13=\"\",\"\",Fixtures!$I$13)","v":1},"D",{"$f":"IF(Fixtures!$H$112=\"\",\"\",Fixtures!$H$112)","v":""},{"$f":"IF(Fixtures!$I$112=\"\",\"\",Fixtures!$I$112)","v":""},"",{"$f":"IF(Fixtures!$H$93=\"\",\"\",Fixtures!$H$93)","v":""},{"$f":"IF(Fixtures!$I$93=\"\",\"\",Fixtures!$I$93)","v":""},"",{"$f":"IF(Fixtures!$H$99=\"\",\"\",Fixtures!$H$99)","v":""},{"$f":"IF(Fixtures!$I$99=\"\",\"\",Fixtures!$I$99)","v":""},"",null,null,"",{"$f":"IF(Fixtures!$H$57=\"\",\"\",Fixtures!$H$57)","v":""},{"$f":"IF(Fixtures!$I$57=\"\",\"\",Fixtures!$I$57)","v":""},"",{"$f":"IF(Fixtures!$H$32=\"\",\"\",Fixtures!$H$32)","v":""},{"$f":"IF(Fixtures!$I$32=\"\",\"\",Fixtures!$I$32)","v":""},"",{"$f":"IF(Fixtures!$H$62=\"\",\"\",Fixtures!$H$62)","v":""},{"$f":"IF(Fixtures!$I$62=\"\",\"\",Fixtures!$I$62)","v":""},"",{"$f":"IF(Fixtures!$H$25=\"\",\"\",Fixtures!$H$25)","v":0},{"$f":"IF(Fixtures!$I$25=\"\",\"\",Fixtures!$I$25)","v":1},"L",0,1,1,{"$f":"(IF(B9=\"\",0,B9))+(IF(E9=\"\",0,E9))+(IF(H9=\"\",0,H9))+(IF(K9=\"\",0,K9))+(IF(N9=\"\",0,N9))+(IF(Q9=\"\",0,Q9))+(IF(T9=\"\",0,T9))+(IF(W9=\"\",0,W9))+(IF(Z9=\"\",0,Z9))+(IF(AC9=\"\",0,AC9))+(IF(AF9=\"\",0,AF9))+(IF(AI9=\"\",0,AI9))","v":1},{"$f":"(IF(C9=\"\",0,C9))+(IF(F9=\"\",0,F9))+(IF(I9=\"\",0,I9))+(IF(L9=\"\",0,L9))+(IF(O9=\"\",0,O9))+(IF(R9=\"\",0,R9))+(IF(U9=\"\",0,U9))+(IF(X9=\"\",0,X9))+(IF(AA9=\"\",0,AA9))+(IF(AD9=\"\",0,AD9))+(IF(AG9=\"\",0,AG9))+(IF(AJ9=\"\",0,AJ9))","v":2},{"$f":"W14","v":0},{"$f":"X14","v":1},{"$f":"Y14","v":1},{"$f":"W16","v":0},{"$f":"X16","v":6},4,0,2,2,1,8,2,-7,0]
[{"$f":"Fixtures!G5","v":"Kilmarnock"},{"$f":"IF(Fixtures!$H$103=\"\",\"\",Fixtures!$H$103)","v":""},{"$f":"IF(Fixtures!$I$103=\"\",\"\",Fixtures!$I$103)","v":""},"",{"$f":"IF(Fixtures!$H$67=\"\",\"\",Fixtures!$H$67)","v":""},{"$f":"IF(Fixtures!$I$67=\"\",\"\",Fixtures!$I$67)","v":""},"",{"$f":"IF(Fixtures!$H$74=\"\",\"\",Fixtures!$H$74)","v":""},{"$f":"IF(Fixtures!$I$74=\"\",\"\",Fixtures!$I$74)","v":""},"",{"$f":"IF(Fixtures!$H$36=\"\",\"\",Fixtures!$H$36)","v":""},{"$f":"IF(Fixtures!$I$36=\"\",\"\",Fixtures!$I$36)","v":""},"",{"$f":"IF(Fixtures!$H$129=\"\",\"\",Fixtures!$H$129)","v":""},{"$f":"IF(Fixtures!$I$129=\"\",\"\",Fixtures!$I$129)","v":""},"",{"$f":"IF(Fixtures!$H$11=\"\",\"\",Fixtures!$H$11)","v":0},{"$f":"IF(Fixtures!$I$11=\"\",\"\",Fixtures!$I$11)","v":3},"L",{"$f":"IF(Fixtures!$H$49=\"\",\"\",Fixtures!$H$49)","v":""},{"$f":"IF(Fixtures!$I$49=\"\",\"\",Fixtures!$I$49)","v":""},"",{"$f":"IF(Fixtures!$H$135=\"\",\"\",Fixtures!$H$135)","v":""},{"$f":"IF(Fixtures!$I$135=\"\",\"\",Fixtures!$I$135)","v":""},"",null,null,"",{"$f":"IF(Fixtures!$H$86=\"\",\"\",Fixtures!$H$86)","v":""},{"$f":"IF(Fixtures!$I$86=\"\",\"\",Fixtures!$I$86)","v":""},"",{"$f":"IF(Fixtures!$H$24=\"\",\"\",Fixtures!$H$24)","v":1},{"$f":"IF(Fixtures!$I$24=\"\",\"\",Fixtures!$I$24)","v":1},"D",{"$f":"IF(Fixtures!$H$117=\"\",\"\",Fixtures!$H$117)","v":""},{"$f":"IF(Fixtures!$I$117=\"\",\"\",Fixtures!$I$117)","v":""},"",0,1,1,{"$f":"(IF(B10=\"\",0,B10))+(IF(E10=\"\",0,E10))+(IF(H10=\"\",0,H10))+(IF(K10=\"\",0,K10))+(IF(N10=\"\",0,N10))+(IF(Q10=\"\",0,Q10))+(IF(T10=\"\",0,T10))+(IF(W10=\"\",0,W10))+(IF(Z10=\"\",0,Z10))+(IF(AC10=\"\",0,AC10))+(IF(AF10=\"\",0,AF10))+(IF(AI10=\"\",0,AI10))","v":1},{"$f":"(IF(C10=\"\",0,C10))+(IF(F10=\"\",0,F10))+(IF(I10=\"\",0,I10))+(IF(L10=\"\",0,L10))+(IF(O10=\"\",0,O10))+(IF(R10=\"\",0,R10))+(IF(U10=\"\",0,U10))+(IF(X10=\"\",0,X10))+(IF(AA10=\"\",0,AA10))+(IF(AD10=\"\",0,AD10))+(IF(AG10=\"\",0,AG10))+(IF(AJ10=\"\",0,AJ10))","v":4},{"$f":"Z14","v":0},{"$f":"AA14","v":0},{"$f":"AB14","v":2},{"$f":"Z16","v":0},{"$f":"AA16","v":6},4,0,1,3,1,10,1,-9,0]
[{"$f":"Fixtures!G6","v":"Dundee"},{"$f":"IF(Fixtures!$H$10=\"\",\"\",Fixtures!$H$10)","v":3},{"$f":"IF(Fixtures!$I$10=\"\",\"\",Fixtures!$I$10)","v":1},"W",{"$f":"IF(Fixtures!$H$90=\"\",\"\",Fixtures!$H$90)","v":""},{"$f":"IF(Fixtures!$I$90=\"\",\"\",Fixtures!$I$90)","v":""},"",{"$f":"IF(Fixtures!$H$101=\"\",\"\",Fixtures!$H$101)","v":""},{"$f":"IF(Fixtures!$I$101=\"\",\"\",Fixtures!$I$101)","v":""},"",{"$f":"IF(Fixtures!$H$127=\"\",\"\",Fixtures!$H$127)","v":""},{"$f":"IF(Fixtures!$I$127=\"\",\"\",Fixtures!$I$127)","v":""},"",{"$f":"IF(Fixtures!$H$22=\"\",\"\",Fixtures!$H$22)","v":2},{"$f":"IF(Fixtures!$I$22=\"\",\"\",Fixtures!$I$22)","v":2},"D",{"$f":"IF(Fixtures!$H$53=\"\",\"\",Fixtures!$H$53)","v":""},{"$f":"IF(Fixtures!$I$53=\"\",\"\",Fixtures!$I$53)","v":""},"",{"$f":"IF(Fixtures!$H$65=\"\",\"\",Fixtures!$H$65)","v":""},{"$f":"IF(Fixtures!$I$65=\"\",\"\",Fixtures!$I$65)","v":""},"",{"$f":"IF(Fixtures!$H$115=\"\",\"\",Fixtures!$H$115)","v":""},{"$f":"IF(Fixtures!$I$115=\"\",\"\",Fixtures!$I$115)","v":""},"",{"$f":"IF(Fixtures!$H$41=\"\",\"\",Fixtures!$H$41)","v":""},{"$f":"IF(Fixtures!$I$41=\"\",\"\",Fixtures!$I$41)","v":""},"",null,null,"",{"$f":"IF(Fixtures!$H$77=\"\",\"\",Fixtures!$H$77)","v":""},{"$f":"IF(Fixtures!$I$77=\"\",\"\",Fixtures!$I$77)","v":""},"",{"$f":"IF(Fixtures!$H$34=\"\",\"\",Fixtures!$H$34)","v":""},{"$f":"IF(Fixtures!$I$34=\"\",\"\",Fixtures!$I$34)","v":""},"",{"$f":"IF(D11=\"W\",1,0)+IF(G11=\"W\",1,0)+IF(J11=\"W\",1,0)+IF(M11=\"W\",1,0)+IF(P11=\"W\",1,0)+IF(S11=\"W\",1,0)+IF(V11=\"W\",1,0)+IF(Y11=\"W\",1,0)+IF(AB11=\"W\",1,0)+IF(AE11=\"W\",1,0)+IF(AH11=\"W\",1,0)+IF(AK11=\"W\",1,0)","v":1},1,0,5,3,{"$f":"AC14","v":0},{"$f":"AD14","v":2},{"$f":"AE14","v":0},{"$f":"AC16","v":4},{"$f":"AD16","v":4},{"$f":"SUM(AW11:AY11)","v":4},{"$f":"AQ11+AL11+AW53","v":1},3,0,9,7,6,2,0]
[{"$f":"Fixtures!G7","v":"Hibernian"},{"$f":"IF(Fixtures!$H$54=\"\",\"\",Fixtures!$H$54)","v":""},{"$f":"IF(Fixtures!$I$54=\"\",\"\",Fixtures!$I$54)","v":""},"",{"$f":"IF(Fixtures!$H$42=\"\",\"\",Fixtures!$H$42)","v":""},{"$f":"IF(Fixtures!$I$42=\"\",\"\",Fixtures!$I$42)","v":""},"",{"$f":"IF(Fixtures!$H$14=\"\",\"\",Fixtures!$H$14)","v":0},{"$f":"IF(Fixtures!$I$14=\"\",\"\",Fixtures!$I$14)","v":2},"L",{"$f":"IF(Fixtures!$H$91=\"\",\"\",Fixtures!$H$91)","v":""},{"$f":"IF(Fixtures!$I$91=\"\",\"\",Fixtures!$I$91)","v":""},"",{"$f":"IF(Fixtures!$H$73=\"\",\"\",Fixtures!$H$73)","v":""},{"$f":"IF(Fixtures!$I$73=\"\",\"\",Fixtures!$I$73)","v":""},"",{"$f":"IF(Fixtures!$H$31=\"\",\"\",Fixtures!$H$31)","v":""},{"$f":"IF(Fixtures!$I$31=\"\",\"\",Fixtures!$I$31)","v":""},"",{"$f":"IF(Fixtures!$H$134=\"\",\"\",Fixtures!$H$134)","v":""},{"$f":"IF(Fixtures!$I$134=\"\",\"\",Fixtures!$I$134)","v":""},"",{"$f":"IF(Fixtures!$H$102=\"\",\"\",Fixtures!$H$102)","v":""},{"$f":"IF(Fixtures!$I$102=\"\",\"\",Fixtures!$I$102)","v":""},"",{"$f":"IF(Fixtures!$H$122=\"\",\"\",Fixtures!$H$122)","v":""},{"$f":"IF(Fixtures!$I$122=\"\",\"\",Fixtures!$I$122)","v":""},"",{"$f":"IF(Fixtures!$H$17=\"\",\"\",Fixtures!$H$17)","v":2},{"$f":"IF(Fixtures!$I$17=\"\",\"\",Fixtures!$I$17)","v":2},"D",null,null,"",{"$f":"IF(Fixtures!$H$66=\"\",\"\",Fixtures!$H$66)","v":""},{"$f":"IF(Fixtures!$I$66=\"\",\"\",Fixtures!$I$66)","v":""},"",{"$f":"IF(D12=\"W\",1,0)+IF(G12=\"W\",1,0)+IF(J12=\"W\",1,0)+IF(M12=\"W\",1,0)+IF(P12=\"W\",1,0)+IF(S12=\"W\",1,0)+IF(V12=\"W\",1,0)+IF(Y12=\"W\",1,0)+IF(AB12=\"W\",1,0)+IF(AE12=\"W\",1,0)+IF(AH12=\"W\",1,0)+IF(AK12=\"W\",1,0)","v":0},{"$f":"IF(D12=\"D\",1,0)+IF(G12=\"D\",1,0)+IF(J12=\"D\",1,0)+IF(M12=\"D\",1,0)+IF(P12=\"D\",1,0)+IF(S12=\"D\",1,0)+IF(V12=\"D\",1,0)+IF(Y12=\"D\",1,0)+IF(AB12=\"D\",1,0)+IF(AE12=\"D\",1,0)+IF(AH12=\"D\",1,0)+IF(AK12=\"D\",1,0)","v":1},{"$f":"IF(D12=\"L\",1,0)+IF(G12=\"L\",1,0)+IF(J12=\"L\",1,0)+IF(M12=\"L\",1,0)+IF(P12=\"L\",1,0)+IF(S12=\"L\",1,0)+IF(V12=\"L\",1,0)+IF(Y12=\"L\",1,0)+IF(AB12=\"L\",1,0)+IF(AE12=\"L\",1,0)+IF(AH12=\"L\",1,0)+IF(AK12=\"L\",1,0)","v":1},{"$f":"(IF(B12=\"\",0,B12))+(IF(E12=\"\",0,E12))+(IF(H12=\"\",0,H12))+(IF(K12=\"\",0,K12))+(IF(N12=\"\",0,N12))+(IF(Q12=\"\",0,Q12))+(IF(T12=\"\",0,T12))+(IF(W12=\"\",0,W12))+(IF(Z12=\"\",0,Z12))+(IF(AC12=\"\",0,AC12))+(IF(AF12=\"\",0,AF12))+(IF(AI12=\"\",0,AI12))","v":2},{"$f":"(IF(C12=\"\",0,C12))+(IF(F12=\"\",0,F12))+(IF(I12=\"\",0,I12))+(IF(L12=\"\",0,L12))+(IF(O12=\"\",0,O12))+(IF(R12=\"\",0,R12))+(IF(U12=\"\",0,U12))+(IF(X12=\"\",0,X12))+(IF(AA12=\"\",0,AA12))+(IF(AD12=\"\",0,AD12))+(IF(AG12=\"\",0,AG12))+(IF(AJ12=\"\",0,AJ12))","v":4},{"$f":"AF14","v":0},{"$f":"AG14","v":1},{"$f":"AH14","v":1},{"$f":"AF16","v":1},{"$f":"AG16","v":4},4,0,2,2,3,8,2,-5,0]
[{"$f":"Fixtures!G8","v":"Aberdeen"},{"$f":"IF(Fixtures!$H$40=\"\",\"\",Fixtures!$H$40)","v":""},{"$f":"IF(Fixtures!$I$40=\"\",\"\",Fixtures!$I$40)","v":""},"",{"$f":"IF(Fixtures!$H$28=\"\",\"\",Fixtures!$H$28)","v":""},{"$f":"IF(Fixtures!$I$28=\"\",\"\",Fixtures!$I$28)","v":""},"",{"$f":"IF(Fixtures!$H$89=\"\",\"\",Fixtures!$H$89)","v":""},{"$f":"IF(Fixtures!$I$89=\"\",\"\",Fixtures!$I$89)","v":""},"",{"$f":"IF(Fixtures!$H$52=\"\",\"\",Fixtures!$H$52)","v":""},{"$f":"IF(Fixtures!$I$52=\"\",\"\",Fixtures!$I$52)","v":""},"",{"$f":"IF(Fixtures!$H$9=\"\",\"\",Fixtures!$H$9)","v":3},{"$f":"IF(Fixtures!$I$9=\"\",\"\",Fixtures!$I$9)","v":1},"W",{"$f":"IF(Fixtures!$H$95=\"\",\"\",Fixtures!$H$95)","v":""},{"$f":"IF(Fixtures!$I$95=\"\",\"\",Fixtures!$I$95)","v":""},"",{"$f":"IF(Fixtures!$H$58=\"\",\"\",Fixtures!$H$58)","v":""},{"$f":"IF(Fixtures!$I$58=\"\",\"\",Fixtures!$I$58)","v":""},"",{"$f":"IF(Fixtures!$H$126=\"\",\"\",Fixtures!$H$126)","v":""},{"$f":"IF(Fixtures!$I$126=\"\",\"\",Fixtures!$I$126)","v":""},"",{"$f":"IF(Fixtures!$H$15=\"\",\"\",Fixtures!$H$15)","v":2},{"$f":"IF(Fixtures!$I$15=\"\",\"\",Fixtures!$I$15)","v":0},"W",{"$f":"IF(Fixtures!$H$71=\"\",\"\",Fixtures!$H$71)","v":""},{"$f":"IF(Fixtures!$I$71=\"\",\"\",Fixtures!$I$71)","v":""},"",{"$f":"IF(Fixtures!$H$107=\"\",\"\",Fixtures!$H$107)","v":""},{"$f":"IF(Fixtures!$I$107=\"\",\"\",Fixtures!$I$107)","v":""},"",null,null,"",{"$f":"IF(D13=\"W\",1,0)+IF(G13=\"W\",1,0)+IF(J13=\"W\",1,0)+IF(M13=\"W\",1,0)+IF(P13=\"W\",1,0)+IF(S13=\"W\",1,0)+IF(V13=\"W\",1,0)+IF(Y13=\"W\",1,0)+IF(AB13=\"W\",1,0)+IF(AE13=\"W\",1,0)+IF(AH13=\"W\",1,0)+IF(AK13=\"W\",1,0)","v":2},{"$f":"IF(D13=\"D\",1,0)+IF(G13=\"D\",1,0)+IF(J13=\"D\",1,0)+IF(M13=\"D\",1,0)+IF(P13=\"D\",1,0)+IF(S13=\"D\",1,0)+IF(V13=\"D\",1,0)+IF(Y13=\"D\",1,0)+IF(AB13=\"D\",1,0)+IF(AE13=\"D\",1,0)+IF(AH13=\"D\",1,0)+IF(AK13=\"D\",1,0)","v":0},{"$f":"IF(D13=\"L\",1,0)+IF(G13=\"L\",1,0)+IF(J13=\"L\",1,0)+IF(M13=\"L\",1,0)+IF(P13=\"L\",1,0)+IF(S13=\"L\",1,0)+IF(V13=\"L\",1,0)+IF(Y13=\"L\",1,0)+IF(AB13=\"L\",1,0)+IF(AE13=\"L\",1,0)+IF(AH13=\"L\",1,0)+IF(AK13=\"L\",1,0)","v":0},5,1,{"$f":"AI14","v":2},{"$f":"AJ14","v":0},{"$f":"AK14","v":0},{"$f":"AI16","v":3},{"$f":"AJ16","v":1},4,4,0,0,{"$f":"AT13+AO13+AZ55","v":8},2,12,6,0]
[null,{"$f":"IF(D2=\"L\",1,0)+IF(D3=\"L\",1,0)+IF(D4=\"L\",1,0)+IF(D5=\"L\",1,0)+IF(D6=\"L\",1,0)+IF(D7=\"L\",1,0)+IF(D8=\"L\",1,0)+IF(D9=\"L\",1,0)+IF(D10=\"L\",1,0)+IF(D11=\"L\",1,0)+IF(D12=\"L\",1,0)+IF(D13=\"L\",1,0)","v":0},{"$f":"IF(D2=\"D\",1,0)+IF(D3=\"D\",1,0)+IF(D4=\"D\",1,0)+IF(D5=\"D\",1,0)+IF(D6=\"D\",1,0)+IF(D7=\"D\",1,0)+IF(D8=\"D\",1,0)+IF(D9=\"D\",1,0)+IF(D10=\"D\",1,0)+IF(D11=\"D\",1,0)+IF(D12=\"D\",1,0)+IF(D13=\"D\",1,0)","v":0},{"$f":"IF(D2=\"W\",1,0)+IF(D3=\"W\",1,0)+IF(D4=\"W\",1,0)+IF(D5=\"W\",1,0)+IF(D6=\"W\",1,0)+IF(D7=\"W\",1,0)+IF(D8=\"W\",1,0)+IF(D9=\"W\",1,0)+IF(D10=\"W\",1,0)+IF(D11=\"W\",1,0)+IF(D12=\"W\",1,0)+IF(D13=\"W\",1,0)","v":2},{"$f":"IF(G2=\"L\",1,0)+IF(G3=\"L\",1,0)+IF(G4=\"L\",1,0)+IF(G5=\"L\",1,0)+IF(G6=\"L\",1,0)+IF(G7=\"L\",1,0)+IF(G8=\"L\",1,0)+IF(G9=\"L\",1,0)+IF(G10=\"L\",1,0)+IF(G11=\"L\",1,0)+IF(G12=\"L\",1,0)+IF(G13=\"L\",1,0)","v":1},{"$f":"IF(G2=\"D\",1,0)+IF(G3=\"D\",1,0)+IF(G4=\"D\",1,0)+IF(G5=\"D\",1,0)+IF(G6=\"D\",1,0)+IF(G7=\"D\",1,0)+IF(G8=\"D\",1,0)+IF(G9=\"D\",1,0)+IF(G10=\"D\",1,0)+IF(G11=\"D\",1,0)+IF(G12=\"D\",1,0)+IF(G13=\"D\",1,0)","v":0},{"$f":"IF(G2=\"W\",1,0)+IF(G3=\"W\",1,0)+IF(G4=\"W\",1,0)+IF(G5=\"W\",1,0)+IF(G6=\"W\",1,0)+IF(G7=\"W\",1,0)+IF(G8=\"W\",1,0)+IF(G9=\"W\",1,0)+IF(G10=\"W\",1,0)+IF(G11=\"W\",1,0)+IF(G12=\"W\",1,0)+IF(G13=\"W\",1,0)","v":1},{"$f":"IF(J2=\"L\",1,0)+IF(J3=\"L\",1,0)+IF(J4=\"L\",1,0)+IF(J5=\"L\",1,0)+IF(J6=\"L\",1,0)+IF(J7=\"L\",1,0)+IF(J8=\"L\",1,0)+IF(J9=\"L\",1,0)+IF(J10=\"L\",1,0)+IF(J11=\"L\",1,0)+IF(J12=\"L\",1,0)+IF(J13=\"L\",1,0)","v":2},{"$f":"IF(J2=\"D\",1,0)+IF(J3=\"D\",1,0)+IF(J4=\"D\",1,0)+IF(J5=\"D\",1,0)+IF(J6=\"D\",1,0)+IF(J7=\"D\",1,0)+IF(J8=\"D\",1,0)+IF(J9=\"D\",1,0)+IF(J10=\"D\",1,0)+IF(J11=\"D\",1,0)+IF(J12=\"D\",1,0)+IF(J13=\"D\",1,0)","v":0},{"$f":"IF(J2=\"W\",1,0)+IF(J3=\"W\",1,0)+IF(J4=\"W\",1,0)+IF(J5=\"W\",1,0)+IF(J6=\"W\",1,0)+IF(J7=\"W\",1,0)+IF(J8=\"W\",1,0)+IF(J9=\"W\",1,0)+IF(J10=\"W\",1,0)+IF(J11=\"W\",1,0)+IF(J12=\"W\",1,0)+IF(J13=\"W\",1,0)","v":0},{"$f":"IF(M2=\"L\",1,0)+IF(M3=\"L\",1,0)+IF(M4=\"L\",1,0)+IF(M5=\"L\",1,0)+IF(M6=\"L\",1,0)+IF(M7=\"L\",1,0)+IF(M8=\"L\",1,0)+IF(M9=\"L\",1,0)+IF(M10=\"L\",1,0)+IF(M11=\"L\",1,0)+IF(M12=\"L\",1,0)+IF(M13=\"L\",1,0)","v":1},{"$f":"IF(M2=\"D\",1,0)+IF(M3=\"D\",1,0)+IF(M4=\"D\",1,0)+IF(M5=\"D\",1,0)+IF(M6=\"D\",1,0)+IF(M7=\"D\",1,0)+IF(M8=\"D\",1,0)+IF(M9=\"D\",1,0)+IF(M10=\"D\",1,0)+IF(M11=\"D\",1,0)+IF(M12=\"D\",1,0)+IF(M13=\"D\",1,0)","v":1},{"$f":"IF(M2=\"W\",1,0)+IF(M3=\"W\",1,0)+IF(M4=\"W\",1,0)+IF(M5=\"W\",1,0)+IF(M6=\"W\",1,0)+IF(M7=\"W\",1,0)+IF(M8=\"W\",1,0)+IF(M9=\"W\",1,0)+IF(M10=\"W\",1,0)+IF(M11=\"W\",1,0)+IF(M12=\"W\",1,0)+IF(M13=\"W\",1,0)","v":0},{"$f":"IF(P2=\"L\",1,0)+IF(P3=\"L\",1,0)+IF(P4=\"L\",1,0)+IF(P5=\"L\",1,0)+IF(P6=\"L\",1,0)+IF(P7=\"L\",1,0)+IF(P8=\"L\",1,0)+IF(P9=\"L\",1,0)+IF(P10=\"L\",1,0)+IF(P11=\"L\",1,0)+IF(P12=\"L\",1,0)+IF(P13=\"L\",1,0)","v":0},{"$f":"IF(P2=\"D\",1,0)+IF(P3=\"D\",1,0)+IF(P4=\"D\",1,0)+IF(P5=\"D\",1,0)+IF(P6=\"D\",1,0)+IF(P7=\"D\",1,0)+IF(P8=\"D\",1,0)+IF(P9=\"D\",1,0)+IF(P10=\"D\",1,0)+IF(P11=\"D\",1,0)+IF(P12=\"D\",1,0)+IF(P13=\"D\",1,0)","v":1},{"$f":"IF(P2=\"W\",1,0)+IF(P3=\"W\",1,0)+IF(P4=\"W\",1,0)+IF(P5=\"W\",1,0)+IF(P6=\"W\",1,0)+IF(P7=\"W\",1,0)+IF(P8=\"W\",1,0)+IF(P9=\"W\",1,0)+IF(P10=\"W\",1,0)+IF(P11=\"W\",1,0)+IF(P12=\"W\",1,0)+IF(P13=\"W\",1,0)","v":1},{"$f":"IF(S2=\"L\",1,0)+IF(S3=\"L\",1,0)+IF(S4=\"L\",1,0)+IF(S5=\"L\",1,0)+IF(S6=\"L\",1,0)+IF(S7=\"L\",1,0)+IF(S8=\"L\",1,0)+IF(S9=\"L\",1,0)+IF(S10=\"L\",1,0)+IF(S11=\"L\",1,0)+IF(S12=\"L\",1,0)+IF(S13=\"L\",1,0)","v":1},{"$f":"IF(S2=\"D\",1,0)+IF(S3=\"D\",1,0)+IF(S4=\"D\",1,0)+IF(S5=\"D\",1,0)+IF(S6=\"D\",1,0)+IF(S7=\"D\",1,0)+IF(S8=\"D\",1,0)+IF(S9=\"D\",1,0)+IF(S10=\"D\",1,0)+IF(S11=\"D\",1,0)+IF(S12=\"D\",1,0)+IF(S13=\"D\",1,0)","v":0},{"$f":"IF(S2=\"W\",1,0)+IF(S3=\"W\",1,0)+IF(S4=\"W\",1,0)+IF(S5=\"W\",1,0)+IF(S6=\"W\",1,0)+IF(S7=\"W\",1,0)+IF(S8=\"W\",1,0)+IF(S9=\"W\",1,0)+IF(S10=\"W\",1,0)+IF(S11=\"W\",1,0)+IF(S12=\"W\",1,0)+IF(S13=\"W\",1,0)","v":1},{"$f":"IF(V2=\"L\",1,0)+IF(V3=\"L\",1,0)+IF(V4=\"L\",1,0)+IF(V5=\"L\",1,0)+IF(V6=\"L\",1,0)+IF(V7=\"L\",1,0)+IF(V8=\"L\",1,0)+IF(V9=\"L\",1,0)+IF(V10=\"L\",1,0)+IF(V11=\"L\",1,0)+IF(V12=\"L\",1,0)+IF(V13=\"L\",1,0)","v":0},{"$f":"IF(V2=\"D\",1,0)+IF(V3=\"D\",1,0)+IF(V4=\"D\",1,0)+IF(V5=\"D\",1,0)+IF(V6=\"D\",1,0)+IF(V7=\"D\",1,0)+IF(V8=\"D\",1,0)+IF(V9=\"D\",1,0)+IF(V10=\"D\",1,0)+IF(V11=\"D\",1,0)+IF(V12=\"D\",1,0)+IF(V13=\"D\",1,0)","v":1},{"$f":"IF(V2=\"W\",1,0)+IF(V3=\"W\",1,0)+IF(V4=\"W\",1,0)+IF(V5=\"W\",1,0)+IF(V6=\"W\",1,0)+IF(V7=\"W\",1,0)+IF(V8=\"W\",1,0)+IF(V9=\"W\",1,0)+IF(V10=\"W\",1,0)+IF(V11=\"W\",1,0)+IF(V12=\"W\",1,0)+IF(V13=\"W\",1,0)","v":1},{"$f":"IF(Y2=\"L\",1,0)+IF(Y3=\"L\",1,0)+IF(Y4=\"L\",1,0)+IF(Y5=\"L\",1,0)+IF(Y6=\"L\",1,0)+IF(Y7=\"L\",1,0)+IF(Y8=\"L\",1,0)+IF(Y9=\"L\",1,0)+IF(Y10=\"L\",1,0)+IF(Y11=\"L\",1,0)+IF(Y12=\"L\",1,0)+IF(Y13=\"L\",1,0)","v":0},{"$f":"IF(Y2=\"D\",1,0)+IF(Y3=\"D\",1,0)+IF(Y4=\"D\",1,0)+IF(Y5=\"D\",1,0)+IF(Y6=\"D\",1,0)+IF(Y7=\"D\",1,0)+IF(Y8=\"D\",1,0)+IF(Y9=\"D\",1,0)+IF(Y10=\"D\",1,0)+IF(Y11=\"D\",1,0)+IF(Y12=\"D\",1,0)+IF(Y13=\"D\",1,0)","v":1},{"$f":"IF(Y2=\"W\",1,0)+IF(Y3=\"W\",1,0)+IF(Y4=\"W\",1,0)+IF(Y5=\"W\",1,0)+IF(Y6=\"W\",1,0)+IF(Y7=\"W\",1,0)+IF(Y8=\"W\",1,0)+IF(Y9=\"W\",1,0)+IF(Y10=\"W\",1,0)+IF(Y11=\"W\",1,0)+IF(Y12=\"W\",1,0)+IF(Y13=\"W\",1,0)","v":1},{"$f":"IF(AB2=\"L\",1,0)+IF(AB3=\"L\",1,0)+IF(AB4=\"L\",1,0)+IF(AB5=\"L\",1,0)+IF(AB6=\"L\",1,0)+IF(AB7=\"L\",1,0)+IF(AB8=\"L\",1,0)+IF(AB9=\"L\",1,0)+IF(AB10=\"L\",1,0)+IF(AB11=\"L\",1,0)+IF(AB12=\"L\",1,0)+IF(AB13=\"L\",1,0)","v":0},{"$f":"IF(AB2=\"D\",1,0)+IF(AB3=\"D\",1,0)+IF(AB4=\"D\",1,0)+IF(AB5=\"D\",1,0)+IF(AB6=\"D\",1,0)+IF(AB7=\"D\",1,0)+IF(AB8=\"D\",1,0)+IF(AB9=\"D\",1,0)+IF(AB10=\"D\",1,0)+IF(AB11=\"D\",1,0)+IF(AB12=\"D\",1,0)+IF(AB13=\"D\",1,0)","v":0},{"$f":"IF(AB2=\"W\",1,0)+IF(AB3=\"W\",1,0)+IF(AB4=\"W\",1,0)+IF(AB5=\"W\",1,0)+IF(AB6=\"W\",1,0)+IF(AB7=\"W\",1,0)+IF(AB8=\"W\",1,0)+IF(AB9=\"W\",1,0)+IF(AB10=\"W\",1,0)+IF(AB11=\"W\",1,0)+IF(AB12=\"W\",1,0)+IF(AB13=\"W\",1,0)","v":2},{"$f":"IF(AE2=\"L\",1,0)+IF(AE3=\"L\",1,0)+IF(AE4=\"L\",1,0)+IF(AE5=\"L\",1,0)+IF(AE6=\"L\",1,0)+IF(AE7=\"L\",1,0)+IF(AE8=\"L\",1,0)+IF(AE9=\"L\",1,0)+IF(AE10=\"L\",1,0)+IF(AE11=\"L\",1,0)+IF(AE12=\"L\",1,0)+IF(AE13=\"L\",1,0)","v":0},{"$f":"IF(AE2=\"D\",1,0)+IF(AE3=\"D\",1,0)+IF(AE4=\"D\",1,0)+IF(AE5=\"D\",1,0)+IF(AE6=\"D\",1,0)+IF(AE7=\"D\",1,0)+IF(AE8=\"D\",1,0)+IF(AE9=\"D\",1,0)+IF(AE10=\"D\",1,0)+IF(AE11=\"D\",1,0)+IF(AE12=\"D\",1,0)+IF(AE13=\"D\",1,0)","v":2},{"$f":"IF(AE2=\"W\",1,0)+IF(AE3=\"W\",1,0)+IF(AE4=\"W\",1,0)+IF(AE5=\"W\",1,0)+IF(AE6=\"W\",1,0)+IF(AE7=\"W\",1,0)+IF(AE8=\"W\",1,0)+IF(AE9=\"W\",1,0)+IF(AE10=\"W\",1,0)+IF(AE11=\"W\",1,0)+IF(AE12=\"W\",1,0)+IF(AE13=\"W\",1,0)","v":0},{"$f":"IF(AH2=\"L\",1,0)+IF(AH3=\"L\",1,0)+IF(AH4=\"L\",1,0)+IF(AH5=\"L\",1,0)+IF(AH6=\"L\",1,0)+IF(AH7=\"L\",1,0)+IF(AH8=\"L\",1,0)+IF(AH9=\"L\",1,0)+IF(AH10=\"L\",1,0)+IF(AH11=\"L\",1,0)+IF(AH12=\"L\",1,0)+IF(AH13=\"L\",1,0)","v":0},{"$f":"IF(AH2=\"D\",1,0)+IF(AH3=\"D\",1,0)+IF(AH4=\"D\",1,0)+IF(AH5=\"D\",1,0)+IF(AH6=\"D\",1,0)+IF(AH7=\"D\",1,0)+IF(AH8=\"D\",1,0)+IF(AH9=\"D\",1,0)+IF(AH10=\"D\",1,0)+IF(AH11=\"D\",1,0)+IF(AH12=\"D\",1,0)+IF(AH13=\"D\",1,0)","v":1},{"$f":"IF(AH2=\"W\",1,0)+IF(AH3=\"W\",1,0)+IF(AH4=\"W\",1,0)+IF(AH5=\"W\",1,0)+IF(AH6=\"W\",1,0)+IF(AH7=\"W\",1,0)+IF(AH8=\"W\",1,0)+IF(AH9=\"W\",1,0)+IF(AH10=\"W\",1,0)+IF(AH11=\"W\",1,0)+IF(AH12=\"W\",1,0)+IF(AH13=\"W\",1,0)","v":1},{"$f":"IF(AK2=\"L\",1,0)+IF(AK3=\"L\",1,0)+IF(AK4=\"L\",1,0)+IF(AK5=\"L\",1,0)+IF(AK6=\"L\",1,0)+IF(AK7=\"L\",1,0)+IF(AK8=\"L\",1,0)+IF(AK9=\"L\",1,0)+IF(AK10=\"L\",1,0)+IF(AK11=\"L\",1,0)+IF(AK12=\"L\",1,0)+IF(AK13=\"L\",1,0)","v":2},{"$f":"IF(AK2=\"D\",1,0)+IF(AK3=\"D\",1,0)+IF(AK4=\"D\",1,0)+IF(AK5=\"D\",1,0)+IF(AK6=\"D\",1,0)+IF(AK7=\"D\",1,0)+IF(AK8=\"D\",1,0)+IF(AK9=\"D\",1,0)+IF(AK10=\"D\",1,0)+IF(AK11=\"D\",1,0)+IF(AK12=\"D\",1,0)+IF(AK13=\"D\",1,0)","v":0},{"$f":"IF(AK2=\"W\",1,0)+IF(AK3=\"W\",1,0)+IF(AK4=\"W\",1,0)+IF(AK5=\"W\",1,0)+IF(AK6=\"W\",1,0)+IF(AK7=\"W\",1,0)+IF(AK8=\"W\",1,0)+IF(AK9=\"W\",1,0)+IF(AK10=\"W\",1,0)+IF(AK11=\"W\",1,0)+IF(AK12=\"W\",1,0)+IF(AK13=\"W\",1,0)","v":0},null,null,null,null,null,null,null,null,null,null,{"$f":"SUM(AV2:AV13)","v":48},17,14,17,67,67,65,0]
[null,"W","D","L","W","D","L","W","D","L","W","D","L","W","D","L","W","D","L","W","D","L","W","D","L","W","D","L","W","D","L","W","D","L","W","D","L",null,null,null,null,null,null,null,null,null,null,{"$f":"IF(AV14=SUM(AW14:AY14),0,1)","v":0},null,{"$f":"AV15+BA15+BC15","v":0},null,null,{"$f":"IF(AZ14=BA14,0,1)","v":0},{"$f":"AW14*3+AX14","v":65},{"$f":"IF(BB14=BB15,0,1)","v":0}]
[null,{"$f":"SUM(C2:C13)","v":2},{"$f":"SUM(B2:B13)","v":6},null,{"$f":"SUM(F2:F13)","v":3},{"$f":"SUM(E2:E13)","v":3},null,{"$f":"SUM(I2:I13)","v":5},{"$f":"SUM(H2:H13)","v":0},null,{"$f":"SUM(L2:L13)","v":2},{"$f":"SUM(K2:K13)","v":1},null,{"$f":"SUM(O2:O13)","v":3},{"$f":"SUM(N2:N13)","v":5},null,{"$f":"SUM(R2:R13)","v":3},{"$f":"SUM(Q2:Q13)","v":2},null,{"$f":"SUM(U2:U13)","v":0},{"$f":"SUM(T2:T13)","v":3},null,{"$f":"SUM(X2:X13)","v":0},{"$f":"SUM(W2:W13)","v":6},null,{"$f":"SUM(AA2:AA13)","v":0},{"$f":"SUM(Z2:Z13)","v":6},null,{"$f":"SUM(AD2:AD13)","v":4},{"$f":"SUM(AC2:AC13)","v":4},null,{"$f":"SUM(AG2:AG13)","v":1},{"$f":"SUM(AF2:AF13)","v":4},null,{"$f":"SUM(AJ2:AJ13)","v":3},{"$f":"SUM(AI2:AI13)","v":1},null,null,null,null,null,null,null,null,null,null,null,"Pld tally",null,"Error Flag",null,null,"Goals tally",null,"Pts tally"]
[null,"F","A",null,"F","A",null,"F","A",null,"F","A",null,"F","A",null,"F","A",null,"F","A",null,"F","A",null,"F","A",null,"F","A",null,"F","A",null,"F","A"]
[]
[null,null,{"$f":"C1","v":"Heart of Midlothian"},null,null,{"$f":"F1","v":"Motherwell"},null,null,{"$f":"I1","v":"Celtic"},null,null,{"$f":"L1","v":"Dundee United"},null,null,{"$f":"O1","v":"St Mirren"},null,null,{"$f":"R1","v":"St Johnstone"},null,null,{"$f":"U1","v":"Rangers"},null,null,{"$f":"X1","v":"Ross County"},null,null,{"$f":"AA1","v":"Kilmarnock"},null,null,{"$f":"AD1","v":"Dundee"},null,null,{"$f":"AG1","v":"Hibernian"},null,null,{"$f":"AJ1","v":"Aberdeen"}]
[{"$f":"A2","v":"Heart of Midlothian"},null,null,null,{"$f":"IF(Fixtures!$H$128=\"\",\"\",Fixtures!$H$128)","v":""},{"$f":"IF(Fixtures!$I$128=\"\",\"\",Fixtures!$I$128)","v":""},null,{"$f":"IF(Fixtures!$H$78=\"\",\"\",Fixtures!$H$78)","v":""},{"$f":"IF(Fixtures!$I$78=\"\",\"\",Fixtures!$I$78)","v":""},null,{"$f":"IF(Fixtures!$H$23=\"\",\"\",Fixtures!$H$23)","v":0},{"$f":"IF(Fixtures!$I$23=\"\",\"\",Fixtures!$I$23)","v":1},null,{"$f":"IF(Fixtures!$H$48=\"\",\"\",Fixtures!$H$48)","v":""},{"$f":"IF(Fixtures!$I$48=\"\",\"\",Fixtures!$I$48)","v":""},null,{"$f":"IF(Fixtures!$H$109=\"\",\"\",Fixtures!$H$109)","v":""},{"$f":"IF(Fixtures!$I$109=\"\",\"\",Fixtures!$I$109)","v":""},null,{"$f":"IF(Fixtures!$H$3=\"\",\"\",Fixtures!$H$3)","v":0},{"$f":"IF(Fixtures!$I$3=\"\",\"\",Fixtures!$I$3)","v":0},null,{"$f":"IF(Fixtures!$H$35=\"\",\"\",Fixtures!$H$35)","v":""},{"$f":"IF(Fixtures!$I$35=\"\",\"\",Fixtures!$I$35)","v":""},null,{"$f":"IF(Fixtures!$H$61=\"\",\"\",Fixtures!$H$61)","v":""},{"$f":"IF(Fixtures!$I$61=\"\",\"\",Fixtures!$I$61)","v":""},null,{"$f":"IF(Fixtures!$H$98=\"\",\"\",Fixtures!$H$98)","v":""},{"$f":"IF(Fixtures!$I$98=\"\",\"\",Fixtures!$I$98)","v":""},null,{"$f":"IF(Fixtures!$H$116=\"\",\"\",Fixtures!$H$116)","v":""},{"$f":"IF(Fixtures!$I$116=\"\",\"\",Fixtures!$I$116)","v":""},null,{"$f":"IF(Fixtures!$H$85=\"\",\"\",Fixtures!$H$85)","v":""},{"$f":"IF(Fixtures!$I$85=\"\",\"\",Fixtures!$I$85)","v":""}]
[{"$f":"A3","v":"Motherwell"},{"$f":"IF(Fixtures!$H$18=\"\",\"\",Fixtures!$H$18)","v":3},{"$f":"IF(Fixtures!$I$18=\"\",\"\",Fixtures!$I$18)","v":1},null,null,null,null,{"$f":"IF(Fixtures!$H$55=\"\",\"\",Fixtures!$H$55)","v":""},{"$f":"IF(Fixtures!$I$55=\"\",\"\",Fixtures!$I$55)","v":""},null,{"$f":"IF(Fixtures!$H$104=\"\",\"\",Fixtures!$H$104)","v":""},{"$f":"IF(Fixtures!$I$104=\"\",\"\",Fixtures!$I$104)","v":""},null,{"$f":"IF(Fixtures!$H$37=\"\",\"\",Fixtures!$H$37)","v":""},{"$f":"IF(Fixtures!$I$37=\"\",\"\",Fixtures!$I$37)","v":""},null,{"$f":"IF(Fixtures!$H$75=\"\",\"\",Fixtures!$H$75)","v":""},{"$f":"IF(Fixtures!$I$75=\"\",\"\",Fixtures!$I$75)","v":""},null,{"$f":"IF(Fixtures!$H$123=\"\",\"\",Fixtures!$H$123)","v":""},{"$f":"IF(Fixtures!$I$123=\"\",\"\",Fixtures!$I$123)","v":""},null,{"$f":"IF(Fixtures!$H$4=\"\",\"\",Fixtures!$H$4)","v":0},{"$f":"IF(Fixtures!$I$4=\"\",\"\",Fixtures!$I$4)","v":0},null,{"$f":"IF(Fixtures!$H$110=\"\",\"\",Fixtures!$H$110)","v":""},{"$f":"IF(Fixtures!$I$110=\"\",\"\",Fixtures!$I$110)","v":""},null,{"$f":"IF(Fixtures!$H$50=\"\",\"\",Fixtures!$H$50)","v":""},{"$f":"IF(Fixtures!$I$50=\"\",\"\",Fixtures!$I$50)","v":""},null,{"$f":"IF(Fixtures!$H$87=\"\",\"\",Fixtures!$H$87)","v":""},{"$f":"IF(Fixtures!$I$87=\"\",\"\",Fixtures!$I$87)","v":""},null,{"$f":"IF(Fixtures!$H$136=\"\",\"\",Fixtures!$H$136)","v":""},{"$f":"IF(Fixtures!$I$136=\"\",\"\",Fixtures!$I$136)","v":""}]
["Celtic",{"$f":"IF(Fixtures!$H$29=\"\",\"\",Fixtures!$H$29)","v":""},{"$f":"IF(Fixtures!$I$29=\"\",\"\",Fixtures!$I$29)","v":""},null,{"$f":"IF(Fixtures!$H$114=\"\",\"\",Fixtures!$H$114)","v":""},{"$f":"IF(Fixtures!$I$114=\"\",\"\",Fixtures!$I$114)","v":""},null,null,null,null,{"$f":"IF(Fixtures!$H$64=\"\",\"\",Fixtures!$H$64)","v":""},{"$f":"IF(Fixtures!$I$64=\"\",\"\",Fixtures!$I$64)","v":""},null,{"$f":"IF(Fixtures!$H$132=\"\",\"\",Fixtures!$H$132)","v":""},{"$f":"IF(Fixtures!$I$132=\"\",\"\",Fixtures!$I$132)","v":""},null,{"$f":"IF(Fixtures!$H$120=\"\",\"\",Fixtures!$H$120)","v":""},{"$f":"IF(Fixtures!$I$120=\"\",\"\",Fixtures!$I$120)","v":""},null,{"$f":"IF(Fixtures!$H$21=\"\",\"\",Fixtures!$H$21)","v":3},{"$f":"IF(Fixtures!$I$21=\"\",\"\",Fixtures!$I$21)","v":0},null,{"$f":"IF(Fixtures!$H$83=\"\",\"\",Fixtures!$H$83)","v":""},{"$f":"IF(Fixtures!$I$83=\"\",\"\",Fixtures!$I$83)","v":""},null,{"$f":"IF(Fixtures!$H$5=\"\",\"\",Fixtures!$H$5)","v":4},{"$f":"IF(Fixtures!$I$5=\"\",\"\",Fixtures!$I$5)","v":0},null,{"$f":"IF(Fixtures!$H$59=\"\",\"\",Fixtures!$H$59)","v":""},{"$f":"IF(Fixtures!$I$59=\"\",\"\",Fixtures!$I$59)","v":""},null,{"$f":"IF(Fixtures!$H$96=\"\",\"\",Fixtures!$H$96)","v":""},{"$f":"IF(Fixtures!$I$96=\"\",\"\",Fixtures!$I$96)","v":""},null,{"$f":"IF(Fixtures!$H$46=\"\",\"\",Fixtures!$H$46)","v":""},{"$f":"IF(Fixtures!$I$46=\"\",\"\",Fixtures!$I$46)","v":""}]
["Dundee United",{"$f":"IF(Fixtures!$H$133=\"\",\"\",Fixtures!$H$133)","v":""},{"$f":"IF(Fixtures!$I$133=\"\",\"\",Fixtures!$I$133)","v":""},null,{"$f":"IF(Fixtures!$H$60=\"\",\"\",Fixtures!$H$60)","v":""},{"$f":"IF(Fixtures!$I$60=\"\",\"\",Fixtures!$I$60)","v":""},null,{"$f":"IF(Fixtures!$H$108=\"\",\"\",Fixtures!$H$108)","v":""},{"$f":"IF(Fixtures!$I$108=\"\",\"\",Fixtures!$I$108)","v":""},null,null,null,null,{"$f":"IF(Fixtures!$H$84=\"\",\"\",Fixtures!$H$84)","v":""},{"$f":"IF(Fixtures!$I$84=\"\",\"\",Fixtures!$I$84)","v":""},null,{"$f":"IF(Fixtures!$H$16=\"\",\"\",Fixtures!$H$16)","v":2},{"$f":"IF(Fixtures!$I$16=\"\",\"\",Fixtures!$I$16)","v":0},null,{"$f":"IF(Fixtures!$H$30=\"\",\"\",Fixtures!$H$30)","v":""},{"$f":"IF(Fixtures!$I$30=\"\",\"\",Fixtures!$I$30)","v":""},null,{"$f":"IF(Fixtures!$H$72=\"\",\"\",Fixtures!$H$72)","v":""},{"$f":"IF(Fixtures!$I$72=\"\",\"\",Fixtures!$I$72)","v":""},null,{"$f":"IF(Fixtures!$H$97=\"\",\"\",Fixtures!$H$97)","v":""},{"$f":"IF(Fixtures!$I$97=\"\",\"\",Fixtures!$I$97)","v":""},null,{"$f":"IF(Fixtures!$H$6=\"\",\"\",Fixtures!$H$6)","v":2},{"$f":"IF(Fixtures!$I$6=\"\",\"\",Fixtures!$I$6)","v":2},null,{"$f":"IF(Fixtures!$H$47=\"\",\"\",Fixtures!$H$47)","v":""},{"$f":"IF(Fixtures!$I$47=\"\",\"\",Fixtures!$I$47)","v":""},null,{"$f":"IF(Fixtures!$H$121=\"\",\"\",Fixtures!$H$121)","v":""},{"$f":"IF(Fixtures!$I$121=\"\",\"\",Fixtures!$I$121)","v":""}]
["St Mirren",{"$f":"IF(Fixtures!$H$94=\"\",\"\",Fixtures!$H$94)","v":""},{"$f":"IF(Fixtures!$I$94=\"\",\"\",Fixtures!$I$94)","v":""},null,{"$f":"IF(Fixtures!$H$100=\"\",\"\",Fixtures!$H$100)","v":""},{"$f":"IF(Fixtures!$I$100=\"\",\"\",Fixtures!$I$100)","v":""},null,{"$f":"IF(Fixtures!$H$20=\"\",\"\",Fixtures!$H$20)","v":0},{"$f":"IF(Fixtures!$I$20=\"\",\"\",Fixtures!$I$20)","v":3},null,{"$f":"IF(Fixtures!$H$45=\"\",\"\",Fixtures!$H$45)","v":""},{"$f":"IF(Fixtures!$I$45=\"\",\"\",Fixtures!$I$45)","v":""},null,null,null,null,{"$f":"IF(Fixtures!$H$63=\"\",\"\",Fixtures!$H$63)","v":""},{"$f":"IF(Fixtures!$I$63=\"\",\"\",Fixtures!$I$63)","v":""},null,{"$f":"IF(Fixtures!$H$119=\"\",\"\",Fixtures!$H$119)","v":""},{"$f":"IF(Fixtures!$I$119=\"\",\"\",Fixtures!$I$119)","v":""},null,{"$f":"IF(Fixtures!$H$69=\"\",\"\",Fixtures!$H$69)","v":""},{"$f":"IF(Fixtures!$I$69=\"\",\"\",Fixtures!$I$69)","v":""},null,{"$f":"IF(Fixtures!$H$33=\"\",\"\",Fixtures!$H$33)","v":""},{"$f":"IF(Fixtures!$I$33=\"\",\"\",Fixtures!$I$33)","v":""},null,{"$f":"IF(Fixtures!$H$125=\"\",\"\",Fixtures!$H$125)","v":""},{"$f":"IF(Fixtures!$I$125=\"\",\"\",Fixtures!$I$125)","v":""},null,{"$f":"IF(Fixtures!$H$7=\"\",\"\",Fixtures!$H$7)","v":3},{"$f":"IF(Fixtures!$I$7=\"\",\"\",Fixtures!$I$7)","v":0},null,{"$f":"IF(Fixtures!$H$82=\"\",\"\",Fixtures!$H$82)","v":""},{"$f":"IF(Fixtures!$I$82=\"\",\"\",Fixtures!$I$82)","v":""}]
["St Johnstone",{"$f":"IF(Fixtures!$H$68=\"\",\"\",Fixtures!$H$68)","v":""},{"$f":"IF(Fixtures!$I$68=\"\",\"\",Fixtures!$I$68)","v":""},null,{"$f":"IF(Fixtures!$H$26=\"\",\"\",Fixtures!$H$26)","v":1},{"$f":"IF(Fixtures!$I$26=\"\",\"\",Fixtures!$I$26)","v":2},null,{"$f":"IF(Fixtures!$H$39=\"\",\"\",Fixtures!$H$39)","v":""},{"$f":"IF(Fixtures!$I$39=\"\",\"\",Fixtures!$I$39)","v":""},null,{"$f":"IF(Fixtures!$H$118=\"\",\"\",Fixtures!$H$118)","v":""},{"$f":"IF(Fixtures!$I$118=\"\",\"\",Fixtures!$I$118)","v":""},null,{"$f":"IF(Fixtures!$H$106=\"\",\"\",Fixtures!$H$106)","v":""},{"$f":"IF(Fixtures!$I$106=\"\",\"\",Fixtures!$I$106)","v":""},null,null,null,null,{"$f":"IF(Fixtures!$H$88=\"\",\"\",Fixtures!$H$88)","v":""},{"$f":"IF(Fixtures!$I$88=\"\",\"\",Fixtures!$I$88)","v":""},null,{"$f":"IF(Fixtures!$H$51=\"\",\"\",Fixtures!$H$51)","v":""},{"$f":"IF(Fixtures!$I$51=\"\",\"\",Fixtures!$I$51)","v":""},null,{"$f":"IF(Fixtures!$H$81=\"\",\"\",Fixtures!$H$81)","v":""},{"$f":"IF(Fixtures!$I$81=\"\",\"\",Fixtures!$I$81)","v":""},null,{"$f":"IF(Fixtures!$H$137=\"\",\"\",Fixtures!$H$137)","v":""},{"$f":"IF(Fixtures!$I$137=\"\",\"\",Fixtures!$I$137)","v":""},null,{"$f":"IF(Fixtures!$H$131=\"\",\"\",Fixtures!$H$131)","v":""},{"$f":"IF(Fixtures!$I$131=\"\",\"\",Fixtures!$I$131)","v":""},null,{"$f":"IF(Fixtures!$H$8=\"\",\"\",Fixtures!$H$8)","v":1},{"$f":"IF(Fixtures!$I$8=\"\",\"\",Fixtures!$I$8)","v":2}]
["Rangers",{"$f":"IF(Fixtures!$H$76=\"\",\"\",Fixtures!$H$76)","v":""},{"$f":"IF(Fixtures!$I$76=\"\",\"\",Fixtures!$I$76)","v":""},null,{"$f":"IF(Fixtures!$H$12=\"\",\"\",Fixtures!$H$12)","v":2},{"$f":"IF(Fixtures!$I$12=\"\",\"\",Fixtures!$I$12)","v":1},null,{"$f":"IF(Fixtures!$H$130=\"\",\"\",Fixtures!$H$130)","v":""},{"$f":"IF(Fixtures!$I$130=\"\",\"\",Fixtures!$I$130)","v":""},null,{"$f":"IF(Fixtures!$H$79=\"\",\"\",Fixtures!$H$79)","v":""},{"$f":"IF(Fixtures!$I$79=\"\",\"\",Fixtures!$I$79)","v":""},null,{"$f":"IF(Fixtures!$H$56=\"\",\"\",Fixtures!$H$56)","v":""},{"$f":"IF(Fixtures!$I$56=\"\",\"\",Fixtures!$I$56)","v":""},null,{"$f":"IF(Fixtures!$H$43=\"\",\"\",Fixtures!$H$43)","v":""},{"$f":"IF(Fixtures!$I$43=\"\",\"\",Fixtures!$I$43)","v":""},null,null,null,null,{"$f":"IF(Fixtures!$H$19=\"\",\"\",Fixtures!$H$19)","v":6},{"$f":"IF(Fixtures!$I$19=\"\",\"\",Fixtures!$I$19)","v":0},null,{"$f":"IF(Fixtures!$H$92=\"\",\"\",Fixtures!$H$92)","v":""},{"$f":"IF(Fixtures!$I$92=\"\",\"\",Fixtures!$I$92)","v":""},null,{"$f":"IF(Fixtures!$H$111=\"\",\"\",Fixtures!$H$111)","v":""},{"$f":"IF(Fixtures!$I$111=\"\",\"\",Fixtures!$I$111)","v":""},null,{"$f":"IF(Fixtures!$H$38=\"\",\"\",Fixtures!$H$38)","v":""},{"$f":"IF(Fixtures!$I$38=\"\",\"\",Fixtures!$I$38)","v":""},null,{"$f":"IF(Fixtures!$H$105=\"\",\"\",Fixtures!$H$105)","v":""},{"$f":"IF(Fixtures!$I$105=\"\",\"\",Fixtures!$I$105)","v":""}]
["Ross County",{"$f":"IF(Fixtures!$H$124=\"\",\"\",Fixtures!$H$124)","v":""},{"$f":"IF(Fixtures!$I$124=\"\",\"\",Fixtures!$I$124)","v":""},null,{"$f":"IF(Fixtures!$H$80=\"\",\"\",Fixtures!$H$80)","v":""},{"$f":"IF(Fixtures!$I$80=\"\",\"\",Fixtures!$I$80)","v":""},null,{"$f":"IF(Fixtures!$H$44=\"\",\"\",Fixtures!$H$44)","v":""},{"$f":"IF(Fixtures!$I$44=\"\",\"\",Fixtures!$I$44)","v":""},null,{"$f":"IF(Fixtures!$H$13=\"\",\"\",Fixtures!$H$13)","v":1},{"$f":"IF(Fixtures!$I$13=\"\",\"\",Fixtures!$I$13)","v":1},null,{"$f":"IF(Fixtures!$H$112=\"\",\"\",Fixtures!$H$112)","v":""},{"$f":"IF(Fixtures!$I$112=\"\",\"\",Fixtures!$I$112)","v":""},null,{"$f":"IF(Fixtures!$H$93=\"\",\"\",Fixtures!$H$93)","v":""},{"$f":"IF(Fixtures!$I$93=\"\",\"\",Fixtures!$I$93)","v":""},null,{"$f":"IF(Fixtures!$H$99=\"\",\"\",Fixtures!$H$99)","v":""},{"$f":"IF(Fixtures!$I$99=\"\",\"\",Fixtures!$I$99)","v":""},null,null,null,null,{"$f":"IF(Fixtures!$H$57=\"\",\"\",Fixtures!$H$57)","v":""},{"$f":"IF(Fixtures!$I$57=\"\",\"\",Fixtures!$I$57)","v":""},null,{"$f":"IF(Fixtures!$H$32=\"\",\"\",Fixtures!$H$32)","v":""},{"$f":"IF(Fixtures!$I$32=\"\",\"\",Fixtures!$I$32)","v":""},null,{"$f":"IF(Fixtures!$H$62=\"\",\"\",Fixtures!$H$62)","v":""},{"$f":"IF(Fixtures!$I$62=\"\",\"\",Fixtures!$I$62)","v":""},null,{"$f":"IF(Fixtures!$H$25=\"\",\"\",Fixtures!$H$25)","v":0},{"$f":"IF(Fixtures!$I$25=\"\",\"\",Fixtures!$I$25)","v":1}]
["Kilmarnock",{"$f":"IF(Fixtures!$H$103=\"\",\"\",Fixtures!$H$103)","v":""},{"$f":"IF(Fixtures!$I$103=\"\",\"\",Fixtures!$I$103)","v":""},null,{"$f":"IF(Fixtures!$H$67=\"\",\"\",Fixtures!$H$67)","v":""},{"$f":"IF(Fixtures!$I$67=\"\",\"\",Fixtures!$I$67)","v":""},null,{"$f":"IF(Fixtures!$H$74=\"\",\"\",Fixtures!$H$74)","v":""},{"$f":"IF(Fixtures!$I$74=\"\",\"\",Fixtures!$I$74)","v":""},null,{"$f":"IF(Fixtures!$H$36=\"\",\"\",Fixtures!$H$36)","v":""},{"$f":"IF(Fixtures!$I$36=\"\",\"\",Fixtures!$I$36)","v":""},null,{"$f":"IF(Fixtures!$H$129=\"\",\"\",Fixtures!$H$129)","v":""},{"$f":"IF(Fixtures!$I$129=\"\",\"\",Fixtures!$I$129)","v":""},null,{"$f":"IF(Fixtures!$H$11=\"\",\"\",Fixtures!$H$11)","v":0},{"$f":"IF(Fixtures!$I$11=\"\",\"\",Fixtures!$I$11)","v":3},null,{"$f":"IF(Fixtures!$H$49=\"\",\"\",Fixtures!$H$49)","v":""},{"$f":"IF(Fixtures!$I$49=\"\",\"\",Fixtures!$I$49)","v":""},null,{"$f":"IF(Fixtures!$H$135=\"\",\"\",Fixtures!$H$135)","v":""},{"$f":"IF(Fixtures!$I$135=\"\",\"\",Fixtures!$I$135)","v":""},null,null,null,null,{"$f":"IF(Fixtures!$H$86=\"\",\"\",Fixtures!$H$86)","v":""},{"$f":"IF(Fixtures!$I$86=\"\",\"\",Fixtures!$I$86)","v":""},null,{"$f":"IF(Fixtures!$H$24=\"\",\"\",Fixtures!$H$24)","v":1},{"$f":"IF(Fixtures!$I$24=\"\",\"\",Fixtures!$I$24)","v":1},null,{"$f":"IF(Fixtures!$H$117=\"\",\"\",Fixtures!$H$117)","v":""},{"$f":"IF(Fixtures!$I$117=\"\",\"\",Fixtures!$I$117)","v":""}]
["Dundee",{"$f":"IF(Fixtures!$H$10=\"\",\"\",Fixtures!$H$10)","v":3},{"$f":"IF(Fixtures!$I$10=\"\",\"\",Fixtures!$I$10)","v":1},null,{"$f":"IF(Fixtures!$H$90=\"\",\"\",Fixtures!$H$90)","v":""},{"$f":"IF(Fixtures!$I$90=\"\",\"\",Fixtures!$I$90)","v":""},null,{"$f":"IF(Fixtures!$H$101=\"\",\"\",Fixtures!$H$101)","v":""},{"$f":"IF(Fixtures!$I$101=\"\",\"\",Fixtures!$I$101)","v":""},null,{"$f":"IF(Fixtures!$H$127=\"\",\"\",Fixtures!$H$127)","v":""},{"$f":"IF(Fixtures!$I$127=\"\",\"\",Fixtures!$I$127)","v":""},null,{"$f":"IF(Fixtures!$H$22=\"\",\"\",Fixtures!$H$22)","v":2},{"$f":"IF(Fixtures!$I$22=\"\",\"\",Fixtures!$I$22)","v":2},null,{"$f":"IF(Fixtures!$H$53=\"\",\"\",Fixtures!$H$53)","v":""},{"$f":"IF(Fixtures!$I$53=\"\",\"\",Fixtures!$I$53)","v":""},null,{"$f":"IF(Fixtures!$H$65=\"\",\"\",Fixtures!$H$65)","v":""},{"$f":"IF(Fixtures!$I$65=\"\",\"\",Fixtures!$I$65)","v":""},null,{"$f":"IF(Fixtures!$H$115=\"\",\"\",Fixtures!$H$115)","v":""},{"$f":"IF(Fixtures!$I$115=\"\",\"\",Fixtures!$I$115)","v":""},null,{"$f":"IF(Fixtures!$H$41=\"\",\"\",Fixtures!$H$41)","v":""},{"$f":"IF(Fixtures!$I$41=\"\",\"\",Fixtures!$I$41)","v":""},null,null,null,null,{"$f":"IF(Fixtures!$H$77=\"\",\"\",Fixtures!$H$77)","v":""},{"$f":"IF(Fixtures!$I$77=\"\",\"\",Fixtures!$I$77)","v":""},null,{"$f":"IF(Fixtures!$H$34=\"\",\"\",Fixtures!$H$34)","v":""},{"$f":"IF(Fixtures!$I$34=\"\",\"\",Fixtures!$I$34)","v":""}]
["Hibernian",{"$f":"IF(Fixtures!$H$54=\"\",\"\",Fixtures!$H$54)","v":""},{"$f":"IF(Fixtures!$I$54=\"\",\"\",Fixtures!$I$54)","v":""},null,{"$f":"IF(Fixtures!$H$42=\"\",\"\",Fixtures!$H$42)","v":""},{"$f":"IF(Fixtures!$I$42=\"\",\"\",Fixtures!$I$42)","v":""},null,{"$f":"IF(Fixtures!$H$14=\"\",\"\",Fixtures!$H$14)","v":0},{"$f":"IF(Fixtures!$I$14=\"\",\"\",Fixtures!$I$14)","v":2},null,{"$f":"IF(Fixtures!$H$91=\"\",\"\",Fixtures!$H$91)","v":""},{"$f":"IF(Fixtures!$I$91=\"\",\"\",Fixtures!$I$91)","v":""},null,{"$f":"IF(Fixtures!$H$73=\"\",\"\",Fixtures!$H$73)","v":""},{"$f":"IF(Fixtures!$I$73=\"\",\"\",Fixtures!$I$73)","v":""},null,{"$f":"IF(Fixtures!$H$31=\"\",\"\",Fixtures!$H$31)","v":""},{"$f":"IF(Fixtures!$I$31=\"\",\"\",Fixtures!$I$31)","v":""},null,{"$f":"IF(Fixtures!$H$134=\"\",\"\",Fixtures!$H$134)","v":""},{"$f":"IF(Fixtures!$I$134=\"\",\"\",Fixtures!$I$134)","v":""},null,{"$f":"IF(Fixtures!$H$102=\"\",\"\",Fixtures!$H$102)","v":""},{"$f":"IF(Fixtures!$I$102=\"\",\"\",Fixtures!$I$102)","v":""},null,{"$f":"IF(Fixtures!$H$122=\"\",\"\",Fixtures!$H$122)","v":""},{"$f":"IF(Fixtures!$I$122=\"\",\"\",Fixtures!$I$122)","v":""},null,{"$f":"IF(Fixtures!$H$17=\"\",\"\",Fixtures!$H$17)","v":2},{"$f":"IF(Fixtures!$I$17=\"\",\"\",Fixtures!$I$17)","v":2},null,null,null,null,{"$f":"IF(Fixtures!$H$66=\"\",\"\",Fixtures!$H$66)","v":""},{"$f":"IF(Fixtures!$I$66=\"\",\"\",Fixtures!$I$66)","v":""}]
["Aberdeen",{"$f":"IF(Fixtures!$H$40=\"\",\"\",Fixtures!$H$40)","v":""},{"$f":"IF(Fixtures!$I$40=\"\",\"\",Fixtures!$I$40)","v":""},null,{"$f":"IF(Fixtures!$H$28=\"\",\"\",Fixtures!$H$28)","v":""},{"$f":"IF(Fixtures!$I$28=\"\",\"\",Fixtures!$I$28)","v":""},null,{"$f":"IF(Fixtures!$H$89=\"\",\"\",Fixtures!$H$89)","v":""},{"$f":"IF(Fixtures!$I$89=\"\",\"\",Fixtures!$I$89)","v":""},null,{"$f":"IF(Fixtures!$H$52=\"\",\"\",Fixtures!$H$52)","v":""},{"$f":"IF(Fixtures!$I$52=\"\",\"\",Fixtures!$I$52)","v":""},null,{"$f":"IF(Fixtures!$H$9=\"\",\"\",Fixtures!$H$9)","v":3},{"$f":"IF(Fixtures!$I$9=\"\",\"\",Fixtures!$I$9)","v":1},null,{"$f":"IF(Fixtures!$H$95=\"\",\"\",Fixtures!$H$95)","v":""},{"$f":"IF(Fixtures!$I$95=\"\",\"\",Fixtures!$I$95)","v":""},null,{"$f":"IF(Fixtures!$H$58=\"\",\"\",Fixtures!$H$58)","v":""},{"$f":"IF(Fixtures!$I$58=\"\",\"\",Fixtures!$I$58)","v":""},null,{"$f":"IF(Fixtures!$H$126=\"\",\"\",Fixtures!$H$126)","v":""},{"$f":"IF(Fixtures!$I$126=\"\",\"\",Fixtures!$I$126)","v":""},null,{"$f":"IF(Fixtures!$H$15=\"\",\"\",Fixtures!$H$15)","v":2},{"$f":"IF(Fixtures!$I$15=\"\",\"\",Fixtures!$I$15)","v":0},null,{"$f":"IF(Fixtures!$H$71=\"\",\"\",Fixtures!$H$71)","v":""},{"$f":"IF(Fixtures!$I$71=\"\",\"\",Fixtures!$I$71)","v":""},null,{"$f":"IF(Fixtures!$H$107=\"\",\"\",Fixtures!$H$107)","v":""},{"$f":"IF(Fixtures!$I$107=\"\",\"\",Fixtures!$I$107)","v":""}]
[]
[]
[{"$f":"12*33","v":396}]
[]
[]
[]
[]
[]
[]
[]
[]
["Pre Split Fixtures",null,{"$f":"A44","v":"Heart of Midlothian"},null,null,{"$f":"A45","v":"Motherwell"},null,null,{"$f":"A46","v":"Celtic"},null,null,{"$f":"A47","v":"Dundee United"},null,null,{"$f":"A48","v":"St Mirren"},null,null,{"$f":"A49","v":"St Johnstone"},null,null,{"$f":"A50","v":"Rangers"},null,null,{"$f":"A51","v":"Ross County"},null,null,{"$f":"A52","v":"Kilmarnock"},null,null,{"$f":"A53","v":"Dundee"},null,null,{"$f":"A54","v":"Hibernian"},null,null,{"$f":"A55","v":"Aberdeen"},null,"HW","HD","HL","HF","HA","AW","AD","AL","AF","AA","P","W","D","L","F","A","Pts","G/D"]
[{"$f":"A2","v":"Heart of Midlothian"},null,null,{"$f":"IF(C44=\"\",\"\",IF(B44>C44,\"W\",IF(B44=C44,\"D\",IF(B44<C44,\"L\"))))","v":""},null,null,{"$f":"IF(F44=\"\",\"\",IF(E44>F44,\"W\",IF(E44=F44,\"D\",IF(E44<F44,\"L\"))))","v":""},null,null,{"$f":"IF(I44=\"\",\"\",IF(H44>I44,\"W\",IF(H44=I44,\"D\",IF(H44<I44,\"L\"))))","v":""},{"$f":"IF(Fixtures!$H$194=\"\",\"\",Fixtures!$H$194)","v":""},{"$f":"IF(Fixtures!$I$194=\"\",\"\",Fixtures!$I$194)","v":""},{"$f":"IF(L44=\"\",\"\",IF(K44>L44,\"W\",IF(K44=L44,\"D\",IF(K44<L44,\"L\"))))","v":""},{"$f":"IF(Fixtures!$H$171=\"\",\"\",Fixtures!$H$171)","v":""},{"$f":"IF(Fixtures!$I$171=\"\",\"\",Fixtures!$I$171)","v":""},{"$f":"IF(O44=\"\",\"\",IF(N44>O44,\"W\",IF(N44=O44,\"D\",IF(N44<O44,\"L\"))))","v":""},null,null,{"$f":"IF(R44=\"\",\"\",IF(Q44>R44,\"W\",IF(Q44=R44,\"D\",IF(Q44<R44,\"L\"))))","v":""},{"$f":"IF(Fixtures!$H$159=\"\",\"\",Fixtures!$H$159)","v":""},{"$f":"IF(Fixtures!$I$159=\"\",\"\",Fixtures!$I$159)","v":""},{"$f":"IF(U44=\"\",\"\",IF(T44>U44,\"W\",IF(T44=U44,\"D\",IF(T44<U44,\"L\"))))","v":""},{"$f":"IF(Fixtures!$H$183=\"\",\"\",Fixtures!$H$183)","v":""},{"$f":"IF(Fixtures!$I$183=\"\",\"\",Fixtures!$I$183)","v":""},{"$f":"IF(X44=\"\",\"\",IF(W44>X44,\"W\",IF(W44=X44,\"D\",IF(W44<X44,\"L\"))))","v":""},{"$f":"IF(Fixtures!$H$147=\"\",\"\",Fixtures!$H$147)","v":""},{"$f":"IF(Fixtures!$I$147=\"\",\"\",Fixtures!$I$147)","v":""},{"$f":"IF(AA44=\"\",\"\",IF(Z44>AA44,\"W\",IF(Z44=AA44,\"D\",IF(Z44<AA44,\"L\"))))","v":""},null,null,{"$f":"IF(AD44=\"\",\"\",IF(AC44>AD44,\"W\",IF(AC44=AD44,\"D\",IF(AC44<AD44,\"L\"))))","v":""},null,null,{"$f":"IF(AG44=\"\",\"\",IF(AF44>AG44,\"W\",IF(AF44=AG44,\"D\",IF(AF44<AG44,\"L\"))))","v":""},null,null,{"$f":"IF(AJ44=\"\",\"\",IF(AI44>AJ44,\"W\",IF(AI44=AJ44,\"D\",IF(AI44<AJ44,\"L\"))))","v":""},{"$f":"IF(D44=\"W\",1,0)+IF(G44=\"W\",1,0)+IF(J44=\"W\",1,0)+IF(M44=\"W\",1,0)+IF(P44=\"W\",1,0)+IF(S44=\"W\",1,0)+IF(V44=\"W\",1,0)+IF(Y44=\"W\",1,0)+IF(AB44=\"W\",1,0)+IF(AE44=\"W\",1,0)+IF(AH44=\"W\",1,0)+IF(AK44=\"W\",1,0)","v":0},{"$f":"IF(D44=\"D\",1,0)+IF(G44=\"D\",1,0)+IF(J44=\"D\",1,0)+IF(M44=\"D\",1,0)+IF(P44=\"D\",1,0)+IF(S44=\"D\",1,0)+IF(V44=\"D\",1,0)+IF(Y44=\"D\",1,0)+IF(AB44=\"D\",1,0)+IF(AE44=\"D\",1,0)+IF(AH44=\"D\",1,0)+IF(AK44=\"D\",1,0)","v":0},{"$f":"IF(D44=\"L\",1,0)+IF(G44=\"L\",1,0)+IF(J44=\"L\",1,0)+IF(M44=\"L\",1,0)+IF(P44=\"L\",1,0)+IF(S44=\"L\",1,0)+IF(V44=\"L\",1,0)+IF(Y44=\"L\",1,0)+IF(AB44=\"L\",1,0)+IF(AE44=\"L\",1,0)+IF(AH44=\"L\",1,0)+IF(AK44=\"L\",1,0)","v":0},{"$f":"(IF(B44=\"\",0,B44))+(IF(E44=\"\",0,E44))+(IF(H44=\"\",0,H44))+(IF(K44=\"\",0,K44))+(IF(N44=\"\",0,N44))+(IF(Q44=\"\",0,Q44))+(IF(T44=\"\",0,T44))+(IF(W44=\"\",0,W44))+(IF(Z44=\"\",0,Z44))+(IF(AC44=\"\",0,AC44))+(IF(AF44=\"\",0,AF44))+(IF(AI44=\"\",0,AI44))","v":0},{"$f":"(IF(C44=\"\",0,C44))+(IF(F44=\"\",0,F44))+(IF(I44=\"\",0,I44))+(IF(L44=\"\",0,L44))+(IF(O44=\"\",0,O44))+(IF(R44=\"\",0,R44))+(IF(U44=\"\",0,U44))+(IF(X44=\"\",0,X44))+(IF(AA44=\"\",0,AA44))+(IF(AD44=\"\",0,AD44))+(IF(AG44=\"\",0,AG44))+(IF(AJ44=\"\",0,AJ44))","v":0},{"$f":"B56","v":0},{"$f":"C56","v":0},{"$f":"D56","v":0},{"$f":"B58","v":0},{"$f":"C58","v":0},{"$f":"SUM(AW44:AY44)","v":0},{"$f":"AQ44+AL44","v":0},{"$f":"AR44+AM44","v":0},{"$f":"AS44+AN44","v":0},0,0,{"$f":"AW44*3+AX44","v":0},{"$f":"AZ44-BA44","v":0}]
[{"$f":"A3","v":"Motherwell"},{"$f":"IF(Fixtures!$H$204=\"\",\"\",Fixtures!$H$204)","v":""},{"$f":"IF(Fixtures!$I$204=\"\",\"\",Fixtures!$I$204)","v":""},{"$f":"IF(C45=\"\",\"\",IF(B45>C45,\"W\",IF(B45=C45,\"D\",IF(B45<C45,\"L\"))))","v":""},null,null,"",{"$f":"IF(Fixtures!$H$153=\"\",\"\",Fixtures!$H$153)","v":""},{"$f":"IF(Fixtures!$I$153=\"\",\"\",Fixtures!$I$153)","v":""},{"$f":"IF(I45=\"\",\"\",IF(H45>I45,\"W\",IF(H45=I45,\"D\",IF(H45<I45,\"L\"))))","v":""},null,null,"",{"$f":"IF(Fixtures!$H$185=\"\",\"\",Fixtures!$H$185)","v":""},{"$f":"IF(Fixtures!$I$185=\"\",\"\",Fixtures!$I$185)","v":""},"",null,null,"",null,null,"",{"$f":"IF(Fixtures!$H$161=\"\",\"\",Fixtures!$H$161)","v":""},{"$f":"IF(Fixtures!$I$161=\"\",\"\",Fixtures!$I$161)","v":""},"",null,null,"",{"$f":"IF(Fixtures!$H$173=\"\",\"\",Fixtures!$H$173)","v":""},{"$f":"IF(Fixtures!$I$173=\"\",\"\",Fixtures!$I$173)","v":""},"",null,null,"",null,null,"",{"$f":"IF(D45=\"W\",1,0)+IF(G45=\"W\",1,0)+IF(J45=\"W\",1,0)+IF(M45=\"W\",1,0)+IF(P45=\"W\",1,0)+IF(S45=\"W\",1,0)+IF(V45=\"W\",1,0)+IF(Y45=\"W\",1,0)+IF(AB45=\"W\",1,0)+IF(AE45=\"W\",1,0)+IF(AH45=\"W\",1,0)+IF(AK45=\"W\",1,0)","v":0},{"$f":"IF(D45=\"D\",1,0)+IF(G45=\"D\",1,0)+IF(J45=\"D\",1,0)+IF(M45=\"D\",1,0)+IF(P45=\"D\",1,0)+IF(S45=\"D\",1,0)+IF(V45=\"D\",1,0)+IF(Y45=\"D\",1,0)+IF(AB45=\"D\",1,0)+IF(AE45=\"D\",1,0)+IF(AH45=\"D\",1,0)+IF(AK45=\"D\",1,0)","v":0},{"$f":"IF(D45=\"L\",1,0)+IF(G45=\"L\",1,0)+IF(J45=\"L\",1,0)+IF(M45=\"L\",1,0)+IF(P45=\"L\",1,0)+IF(S45=\"L\",1,0)+IF(V45=\"L\",1,0)+IF(Y45=\"L\",1,0)+IF(AB45=\"L\",1,0)+IF(AE45=\"L\",1,0)+IF(AH45=\"L\",1,0)+IF(AK45=\"L\",1,0)","v":0},{"$f":"(IF(B45=\"\",0,B45))+(IF(E45=\"\",0,E45))+(IF(H45=\"\",0,H45))+(IF(K45=\"\",0,K45))+(IF(N45=\"\",0,N45))+(IF(Q45=\"\",0,Q45))+(IF(T45=\"\",0,T45))+(IF(W45=\"\",0,W45))+(IF(Z45=\"\",0,Z45))+(IF(AC45=\"\",0,AC45))+(IF(AF45=\"\",0,AF45))+(IF(AI45=\"\",0,AI45))","v":0},{"$f":"(IF(C45=\"\",0,C45))+(IF(F45=\"\",0,F45))+(IF(I45=\"\",0,I45))+(IF(L45=\"\",0,L45))+(IF(O45=\"\",0,O45))+(IF(R45=\"\",0,R45))+(IF(U45=\"\",0,U45))+(IF(X45=\"\",0,X45))+(IF(AA45=\"\",0,AA45))+(IF(AD45=\"\",0,AD45))+(IF(AG45=\"\",0,AG45))+(IF(AJ45=\"\",0,AJ45))","v":0},{"$f":"E56","v":0},{"$f":"F56","v":0},{"$f":"G56","v":0},{"$f":"E58","v":0},{"$f":"F58","v":0},{"$f":"SUM(AW45:AY45)","v":0},0,0,0,0,0,{"$f":"AW45*3+AX45","v":0},{"$f":"AZ45-BA45","v":0}]
["Celtic",{"$f":"IF(Fixtures!$H$188=\"\",\"\",Fixtures!$H$188)","v":""},{"$f":"IF(Fixtures!$I$188=\"\",\"\",Fixtures!$I$188)","v":""},"",null,null,"",null,null,"",{"$f":"IF(Fixtures!$H$157=\"\",\"\",Fixtures!$H$157)","v":""},{"$f":"IF(Fixtures!$I$157=\"\",\"\",Fixtures!$I$157)","v":""},"",null,null,"",null,null,"",{"$f":"IF(Fixtures!$H$181=\"\",\"\",Fixtures!$H$181)","v":""},{"$f":"IF(Fixtures!$I$181=\"\",\"\",Fixtures!$I$181)","v":""},"",null,null,"",{"$f":"IF(Fixtures!$H$201=\"\",\"\",Fixtures!$H$201)","v":""},{"$f":"IF(Fixtures!$I$201=\"\",\"\",Fixtures!$I$201)","v":""},"",{"$f":"IF(Fixtures!$H$145=\"\",\"\",Fixtures!$H$145)","v":""},{"$f":"IF(Fixtures!$I$145=\"\",\"\",Fixtures!$I$145)","v":""},"",null,null,"",{"$f":"IF(Fixtures!$H$169=\"\",\"\",Fixtures!$H$169)","v":""},{"$f":"IF(Fixtures!$I$169=\"\",\"\",Fixtures!$I$169)","v":""},"",{"$f":"IF(D46=\"W\",1,0)+IF(G46=\"W\",1,0)+IF(J46=\"W\",1,0)+IF(M46=\"W\",1,0)+IF(P46=\"W\",1,0)+IF(S46=\"W\",1,0)+IF(V46=\"W\",1,0)+IF(Y46=\"W\",1,0)+IF(AB46=\"W\",1,0)+IF(AE46=\"W\",1,0)+IF(AH46=\"W\",1,0)+IF(AK46=\"W\",1,0)","v":0},0,0,0,0,{"$f":"H56","v":0},{"$f":"I56","v":0},{"$f":"J56","v":0},{"$f":"H58","v":0},{"$f":"I58","v":0},0,{"$f":"AQ46+AL46","v":0},0,0,0,0,0,0]
["Dundee United",null,null,"",{"$f":"IF(Fixtures!$H$164=\"\",\"\",Fixtures!$H$164)","v":""},{"$f":"IF(Fixtures!$I$164=\"\",\"\",Fixtures!$I$164)","v":""},"",null,null,"",null,null,null,null,null,"",{"$f":"IF(Fixtures!$H$202=\"\",\"\",Fixtures!$H$202)","v":""},{"$f":"IF(Fixtures!$I$202=\"\",\"\",Fixtures!$I$202)","v":""},"",{"$f":"IF(Fixtures!$H$146=\"\",\"\",Fixtures!$H$146)","v":""},{"$f":"IF(Fixtures!$I$146=\"\",\"\",Fixtures!$I$146)","v":""},"",null,null,"",null,null,"",{"$f":"IF(Fixtures!$H$182=\"\",\"\",Fixtures!$H$182)","v":""},{"$f":"IF(Fixtures!$I$182=\"\",\"\",Fixtures!$I$182)","v":""},"",{"$f":"IF(Fixtures!$H$170=\"\",\"\",Fixtures!$H$170)","v":""},{"$f":"IF(Fixtures!$I$170=\"\",\"\",Fixtures!$I$170)","v":""},"",null,null,"",{"$f":"IF(D47=\"W\",1,0)+IF(G47=\"W\",1,0)+IF(J47=\"W\",1,0)+IF(M47=\"W\",1,0)+IF(P47=\"W\",1,0)+IF(S47=\"W\",1,0)+IF(V47=\"W\",1,0)+IF(Y47=\"W\",1,0)+IF(AB47=\"W\",1,0)+IF(AE47=\"W\",1,0)+IF(AH47=\"W\",1,0)+IF(AK47=\"W\",1,0)","v":0},0,0,0,0,{"$f":"K56","v":0},{"$f":"L56","v":0},{"$f":"M56","v":0},{"$f":"K58","v":0},{"$f":"L58","v":0},0,{"$f":"AQ47+AL47","v":0},0,0,0,0,0,0]
["St Mirren",null,null,"",null,null,"",{"$f":"IF(Fixtures!$H$180=\"\",\"\",Fixtures!$H$180)","v":""},{"$f":"IF(Fixtures!$I$180=\"\",\"\",Fixtures!$I$180)","v":""},"",{"$f":"IF(Fixtures!$H$143=\"\",\"\",Fixtures!$H$143)","v":""},{"$f":"IF(Fixtures!$I$143=\"\",\"\",Fixtures!$I$143)","v":""},"",null,null,"",{"$f":"IF(Fixtures!$H$155=\"\",\"\",Fixtures!$H$155)","v":""},{"$f":"IF(Fixtures!$I$155=\"\",\"\",Fixtures!$I$155)","v":""},"",null,null,"",{"$f":"IF(Fixtures!$H$205=\"\",\"\",Fixtures!$H$205)","v":""},{"$f":"IF(Fixtures!$I$205=\"\",\"\",Fixtures!$I$205)","v":""},"",{"$f":"IF(Fixtures!$H$192=\"\",\"\",Fixtures!$H$192)","v":""},{"$f":"IF(Fixtures!$I$192=\"\",\"\",Fixtures!$I$192)","v":""},"",null,null,"",{"$f":"IF(Fixtures!$H$162=\"\",\"\",Fixtures!$H$162)","v":""},{"$f":"IF(Fixtures!$I$162=\"\",\"\",Fixtures!$I$162)","v":""},"",null,null,"",0,0,0,0,0,{"$f":"N56","v":0},{"$f":"O56","v":0},{"$f":"P56","v":0},{"$f":"N58","v":0},{"$f":"O58","v":0},0,0,0,0,{"$f":"AT48+AO48","v":0},0,0,0]
["St Johnstone",{"$f":"IF(Fixtures!$H$168=\"\",\"\",Fixtures!$H$168)","v":""},{"$f":"IF(Fixtures!$I$168=\"\",\"\",Fixtures!$I$168)","v":""},"",{"$f":"IF(Fixtures!$H$149=\"\",\"\",Fixtures!$H$149)","v":""},{"$f":"IF(Fixtures!$I$149=\"\",\"\",Fixtures!$I$149)","v":""},"",{"$f":"IF(Fixtures!$H$198=\"\",\"\",Fixtures!$H$198)","v":""},{"$f":"IF(Fixtures!$I$198=\"\",\"\",Fixtures!$I$198)","v":""},"",null,null,"",null,null,"",null,null,"",null,null,"",{"$f":"IF(Fixtures!$H$174=\"\",\"\",Fixtures!$H$174)","v":""},{"$f":"IF(Fixtures!$I$174=\"\",\"\",Fixtures!$I$174)","v":""},"",null,null,"",null,null,"",null,null,"",{"$f":"IF(Fixtures!$H$186=\"\",\"\",Fixtures!$H$186)","v":""},{"$f":"IF(Fixtures!$I$186=\"\",\"\",Fixtures!$I$186)","v":""},"",0,0,0,0,0,{"$f":"Q56","v":0},{"$f":"R56","v":0},{"$f":"S56","v":0},{"$f":"Q58","v":0},{"$f":"R58","v":0},{"$f":"SUM(AW49:AY49)","v":0},{"$f":"AQ49+AL49","v":0},{"$f":"AR49+AM49","v":0},{"$f":"AS49+AN49","v":0},{"$f":"AT49+AO49","v":0},{"$f":"AU49+AP49","v":0},{"$f":"AW49*3+AX49","v":0},{"$f":"AZ49-BA49","v":0}]
["Rangers",null,null,"",{"$f":"IF(Fixtures!$H$178=\"\",\"\",Fixtures!$H$178)","v":""},{"$f":"IF(Fixtures!$I$178=\"\",\"\",Fixtures!$I$178)","v":""},"",null,null,"",null,null,"",{"$f":"IF(Fixtures!$H$166=\"\",\"\",Fixtures!$H$166)","v":""},{"$f":"IF(Fixtures!$I$166=\"\",\"\",Fixtures!$I$166)","v":""},"",{"$f":"IF(Fixtures!$H$141=\"\",\"\",Fixtures!$H$141)","v":""},{"$f":"IF(Fixtures!$I$141=\"\",\"\",Fixtures!$I$141)","v":""},"",null,null,"",{"$f":"IF(Fixtures!$H$154=\"\",\"\",Fixtures!$H$154)","v":""},{"$f":"IF(Fixtures!$I$154=\"\",\"\",Fixtures!$I$154)","v":""},"",null,null,"",null,null,"",{"$f":"IF(Fixtures!$H$196=\"\",\"\",Fixtures!$H$196)","v":""},{"$f":"IF(Fixtures!$I$196=\"\",\"\",Fixtures!$I$196)","v":""},"",null,null,"",0,0,0,0,0,{"$f":"T56","v":0},{"$f":"U56","v":0},{"$f":"V56","v":0},{"$f":"T58","v":0},{"$f":"U58","v":0},0,0,0,0,0,0,0,0]
["Ross County",null,null,"",null,null,"",{"$f":"IF(Fixtures!$H$142=\"\",\"\",Fixtures!$H$142)","v":""},{"$f":"IF(Fixtures!$I$142=\"\",\"\",Fixtures!$I$142)","v":""},"",{"$f":"IF(Fixtures!$H$191=\"\",\"\",Fixtures!$H$191)","v":""},{"$f":"IF(Fixtures!$I$191=\"\",\"\",Fixtures!$I$191)","v":""},"",null,null,"",null,null,"",null,null,"",null,null,"",{"$f":"IF(Fixtures!$H$179=\"\",\"\",Fixtures!$H$179)","v":""},{"$f":"IF(Fixtures!$I$179=\"\",\"\",Fixtures!$I$179)","v":""},"",{"$f":"IF(Fixtures!$H$167=\"\",\"\",Fixtures!$H$167)","v":""},{"$f":"IF(Fixtures!$I$167=\"\",\"\",Fixtures!$I$167)","v":""},"",{"$f":"IF(Fixtures!$H$148=\"\",\"\",Fixtures!$H$148)","v":""},{"$f":"IF(Fixtures!$I$148=\"\",\"\",Fixtures!$I$148)","v":""},"",{"$f":"IF(Fixtures!$H$197=\"\",\"\",Fixtures!$H$197)","v":""},{"$f":"IF(Fixtures!$I$197=\"\",\"\",Fixtures!$I$197)","v":""},"",0,0,0,0,0,{"$f":"W56","v":0},{"$f":"X56","v":0},{"$f":"Y56","v":0},{"$f":"W58","v":0},{"$f":"X58","v":0},0,0,0,0,0,0,0,0]
["Kilmarnock",null,null,"",{"$f":"IF(Fixtures!$H$195=\"\",\"\",Fixtures!$H$195)","v":""},{"$f":"IF(Fixtures!$I$195=\"\",\"\",Fixtures!$I$195)","v":""},"",null,null,"",{"$f":"IF(Fixtures!$H$152=\"\",\"\",Fixtures!$H$152)","v":""},{"$f":"IF(Fixtures!$I$152=\"\",\"\",Fixtures!$I$152)","v":""},"",null,null,"",{"$f":"IF(Fixtures!$H$160=\"\",\"\",Fixtures!$H$160)","v":""},{"$f":"IF(Fixtures!$I$160=\"\",\"\",Fixtures!$I$160)","v":""},"",{"$f":"IF(Fixtures!$H$172=\"\",\"\",Fixtures!$H$172)","v":""},{"$f":"IF(Fixtures!$I$172=\"\",\"\",Fixtures!$I$172)","v":""},"",null,null,"",null,null,"",null,null,"",{"$f":"IF(Fixtures!$H$184=\"\",\"\",Fixtures!$H$184)","v":""},{"$f":"IF(Fixtures!$I$184=\"\",\"\",Fixtures!$I$184)","v":""},"",null,null,"",0,0,0,0,0,{"$f":"Z56","v":0},{"$f":"AA56","v":0},{"$f":"AB56","v":0},{"$f":"Z58","v":0},{"$f":"AA58","v":0},0,0,0,0,0,0,0,0]
["Dundee",{"$f":"IF(Fixtures!$H$150=\"\",\"\",Fixtures!$H$150)","v":""},{"$f":"IF(Fixtures!$I$150=\"\",\"\",Fixtures!$I$150)","v":""},"",null,null,"",null,null,"",null,null,"",{"$f":"IF(Fixtures!$H$193=\"\",\"\",Fixtures!$H$193)","v":""},{"$f":"IF(Fixtures!$I$193=\"\",\"\",Fixtures!$I$193)","v":""},"",{"$f":"IF(Fixtures!$H$176=\"\",\"\",Fixtures!$H$176)","v":""},{"$f":"IF(Fixtures!$I$176=\"\",\"\",Fixtures!$I$176)","v":""},"",{"$f":"IF(Fixtures!$H$189=\"\",\"\",Fixtures!$H$189)","v":""},{"$f":"IF(Fixtures!$I$189=\"\",\"\",Fixtures!$I$189)","v":""},"",null,null,"",{"$f":"IF(Fixtures!$H$139=\"\",\"\",Fixtures!$H$139)","v":""},{"$f":"IF(Fixtures!$I$139=\"\",\"\",Fixtures!$I$139)","v":""},"",null,null,{"$f":"IF(AD53=\"\",\"\",IF(AC53>AD53,\"W\",IF(AC53=AD53,\"D\",IF(AC53<AD53,\"L\"))))","v":""},null,null,"",{"$f":"IF(Fixtures!$H$158=\"\",\"\",Fixtures!$H$158)","v":""},{"$f":"IF(Fixtures!$I$158=\"\",\"\",Fixtures!$I$158)","v":""},"",0,0,0,0,0,{"$f":"AC56","v":0},{"$f":"AD56","v":0},{"$f":"AE56","v":0},{"$f":"AC58","v":0},{"$f":"AD58","v":0},0,0,0,0,0,0,0,0]
["Hibernian",{"$f":"IF(Fixtures!$H$177=\"\",\"\",Fixtures!$H$177)","v":""},{"$f":"IF(Fixtures!$I$177=\"\",\"\",Fixtures!$I$177)","v":""},"",{"$f":"IF(Fixtures!$H$140=\"\",\"\",Fixtures!$H$140)","v":""},{"$f":"IF(Fixtures!$I$140=\"\",\"\",Fixtures!$I$140)","v":""},"",{"$f":"IF(Fixtures!$H$165=\"\",\"\",Fixtures!$H$165)","v":""},{"$f":"IF(Fixtures!$I$165=\"\",\"\",Fixtures!$I$165)","v":""},"",null,null,"",null,null,"",{"$f":"IF(Fixtures!$H$190=\"\",\"\",Fixtures!$H$190)","v":""},{"$f":"IF(Fixtures!$I$190=\"\",\"\",Fixtures!$I$190)","v":""},"",null,null,"",null,null,"",null,null,"",{"$f":"IF(Fixtures!$H$203=\"\",\"\",Fixtures!$H$203)","v":""},{"$f":"IF(Fixtures!$I$203=\"\",\"\",Fixtures!$I$203)","v":""},{"$f":"IF(AD54=\"\",\"\",IF(AC54>AD54,\"W\",IF(AC54=AD54,\"D\",IF(AC54<AD54,\"L\"))))","v":""},null,null,"",{"$f":"IF(Fixtures!$H$151=\"\",\"\",Fixtures!$H$151)","v":""},{"$f":"IF(Fixtures!$I$151=\"\",\"\",Fixtures!$I$151)","v":""},"",0,0,0,0,0,{"$f":"AF56","v":0},{"$f":"AG56","v":0},{"$f":"AH56","v":0},{"$f":"AF58","v":0},{"$f":"AG58","v":0},{"$f":"SUM(AW54:AY54)","v":0},{"$f":"AQ54+AL54","v":0},{"$f":"AR54+AM54","v":0},{"$f":"AS54+AN54","v":0},{"$f":"AT54+AO54","v":0},{"$f":"AU54+AP54","v":0},{"$f":"AW54*3+AX54","v":0},{"$f":"AZ54-BA54","v":0}]
["Aberdeen",{"$f":"IF(Fixtures!$H$138=\"\",\"\",Fixtures!$H$138)","v":""},{"$f":"IF(Fixtures!$I$138=\"\",\"\",Fixtures!$I$138)","v":""},"",{"$f":"IF(Fixtures!$H$187=\"\",\"\",Fixtures!$H$187)","v":""},{"$f":"IF(Fixtures!$I$187=\"\",\"\",Fixtures!$I$187)","v":""},"",null,null,"",{"$f":"IF(Fixtures!$H$175=\"\",\"\",Fixtures!$H$175)","v":""},{"$f":"IF(Fixtures!$I$175=\"\",\"\",Fixtures!$I$175)","v":""},"",{"$f":"IF(Fixtures!$H$144=\"\",\"\",Fixtures!$H$144)","v":""},{"$f":"IF(Fixtures!$I$144=\"\",\"\",Fixtures!$I$144)","v":""},"",null,null,"",{"$f":"IF(Fixtures!$H$200=\"\",\"\",Fixtures!$H$200)","v":""},{"$f":"IF(Fixtures!$I$200=\"\",\"\",Fixtures!$I$200)","v":""},"",null,null,"",{"$f":"IF(Fixtures!$H$163=\"\",\"\",Fixtures!$H$163)","v":""},{"$f":"IF(Fixtures!$I$163=\"\",\"\",Fixtures!$I$163)","v":""},"",null,null,{"$f":"IF(AD55=\"\",\"\",IF(AC55>AD55,\"W\",IF(AC55=AD55,\"D\",IF(AC55<AD55,\"L\"))))","v":""},null,null,"",null,null,"",{"$f":"IF(D55=\"W\",1,0)+IF(G55=\"W\",1,0)+IF(J55=\"W\",1,0)+IF(M55=\"W\",1,0)+IF(P55=\"W\",1,0)+IF(S55=\"W\",1,0)+IF(V55=\"W\",1,0)+IF(Y55=\"W\",1,0)+IF(AB55=\"W\",1,0)+IF(AE55=\"W\",1,0)+IF(AH55=\"W\",1,0)+IF(AK55=\"W\",1,0)","v":0},{"$f":"IF(D55=\"D\",1,0)+IF(G55=\"D\",1,0)+IF(J55=\"D\",1,0)+IF(M55=\"D\",1,0)+IF(P55=\"D\",1,0)+IF(S55=\"D\",1,0)+IF(V55=\"D\",1,0)+IF(Y55=\"D\",1,0)+IF(AB55=\"D\",1,0)+IF(AE55=\"D\",1,0)+IF(AH55=\"D\",1,0)+IF(AK55=\"D\",1,0)","v":0},{"$f":"IF(D55=\"L\",1,0)+IF(G55=\"L\",1,0)+IF(J55=\"L\",1,0)+IF(M55=\"L\",1,0)+IF(P55=\"L\",1,0)+IF(S55=\"L\",1,0)+IF(V55=\"L\",1,0)+IF(Y55=\"L\",1,0)+IF(AB55=\"L\",1,0)+IF(AE55=\"L\",1,0)+IF(AH55=\"L\",1,0)+IF(AK55=\"L\",1,0)","v":0},0,{"$f":"(IF(C55=\"\",0,C55))+(IF(F55=\"\",0,F55))+(IF(I55=\"\",0,I55))+(IF(L55=\"\",0,L55))+(IF(O55=\"\",0,O55))+(IF(R55=\"\",0,R55))+(IF(U55=\"\",0,U55))+(IF(X55=\"\",0,X55))+(IF(AA55=\"\",0,AA55))+(IF(AD55=\"\",0,AD55))+(IF(AG55=\"\",0,AG55))+(IF(AJ55=\"\",0,AJ55))","v":0},{"$f":"AI56","v":0},{"$f":"AJ56","v":0},{"$f":"AK56","v":0},{"$f":"AI58","v":0},{"$f":"AJ58","v":0},0,0,0,0,0,0,0,0]
[null,{"$f":"IF(D44=\"L\",1,0)+IF(D45=\"L\",1,0)+IF(D46=\"L\",1,0)+IF(D47=\"L\",1,0)+IF(D48=\"L\",1,0)+IF(D49=\"L\",1,0)+IF(D50=\"L\",1,0)+IF(D51=\"L\",1,0)+IF(D52=\"L\",1,0)+IF(D53=\"L\",1,0)+IF(D54=\"L\",1,0)+IF(D55=\"L\",1,0)","v":0},{"$f":"IF(D44=\"D\",1,0)+IF(D45=\"D\",1,0)+IF(D46=\"D\",1,0)+IF(D47=\"D\",1,0)+IF(D48=\"D\",1,0)+IF(D49=\"D\",1,0)+IF(D50=\"D\",1,0)+IF(D51=\"D\",1,0)+IF(D52=\"D\",1,0)+IF(D53=\"D\",1,0)+IF(D54=\"D\",1,0)+IF(D55=\"D\",1,0)","v":0},{"$f":"IF(D44=\"W\",1,0)+IF(D45=\"W\",1,0)+IF(D46=\"W\",1,0)+IF(D47=\"W\",1,0)+IF(D48=\"W\",1,0)+IF(D49=\"W\",1,0)+IF(D50=\"W\",1,0)+IF(D51=\"W\",1,0)+IF(D52=\"W\",1,0)+IF(D53=\"W\",1,0)+IF(D54=\"W\",1,0)+IF(D55=\"W\",1,0)","v":0},{"$f":"IF(G44=\"L\",1,0)+IF(G45=\"L\",1,0)+IF(G46=\"L\",1,0)+IF(G47=\"L\",1,0)+IF(G48=\"L\",1,0)+IF(G49=\"L\",1,0)+IF(G50=\"L\",1,0)+IF(G51=\"L\",1,0)+IF(G52=\"L\",1,0)+IF(G53=\"L\",1,0)+IF(G54=\"L\",1,0)+IF(G55=\"L\",1,0)","v":0},{"$f":"IF(G44=\"D\",1,0)+IF(G45=\"D\",1,0)+IF(G46=\"D\",1,0)+IF(G47=\"D\",1,0)+IF(G48=\"D\",1,0)+IF(G49=\"D\",1,0)+IF(G50=\"D\",1,0)+IF(G51=\"D\",1,0)+IF(G52=\"D\",1,0)+IF(G53=\"D\",1,0)+IF(G54=\"D\",1,0)+IF(G55=\"D\",1,0)","v":0},{"$f":"IF(G44=\"W\",1,0)+IF(G45=\"W\",1,0)+IF(G46=\"W\",1,0)+IF(G47=\"W\",1,0)+IF(G48=\"W\",1,0)+IF(G49=\"W\",1,0)+IF(G50=\"W\",1,0)+IF(G51=\"W\",1,0)+IF(G52=\"W\",1,0)+IF(G53=\"W\",1,0)+IF(G54=\"W\",1,0)+IF(G55=\"W\",1,0)","v":0},{"$f":"IF(J44=\"L\",1,0)+IF(J45=\"L\",1,0)+IF(J46=\"L\",1,0)+IF(J47=\"L\",1,0)+IF(J48=\"L\",1,0)+IF(J49=\"L\",1,0)+IF(J50=\"L\",1,0)+IF(J51=\"L\",1,0)+IF(J52=\"L\",1,0)+IF(J53=\"L\",1,0)+IF(J54=\"L\",1,0)+IF(J55=\"L\",1,0)","v":0},{"$f":"IF(J44=\"D\",1,0)+IF(J45=\"D\",1,0)+IF(J46=\"D\",1,0)+IF(J47=\"D\",1,0)+IF(J48=\"D\",1,0)+IF(J49=\"D\",1,0)+IF(J50=\"D\",1,0)+IF(J51=\"D\",1,0)+IF(J52=\"D\",1,0)+IF(J53=\"D\",1,0)+IF(J54=\"D\",1,0)+IF(J55=\"D\",1,0)","v":0},{"$f":"IF(J44=\"W\",1,0)+IF(J45=\"W\",1,0)+IF(J46=\"W\",1,0)+IF(J47=\"W\",1,0)+IF(J48=\"W\",1,0)+IF(J49=\"W\",1,0)+IF(J50=\"W\",1,0)+IF(J51=\"W\",1,0)+IF(J52=\"W\",1,0)+IF(J53=\"W\",1,0)+IF(J54=\"W\",1,0)+IF(J55=\"W\",1,0)","v":0},{"$f":"IF(M44=\"L\",1,0)+IF(M45=\"L\",1,0)+IF(M46=\"L\",1,0)+IF(M47=\"L\",1,0)+IF(M48=\"L\",1,0)+IF(M49=\"L\",1,0)+IF(M50=\"L\",1,0)+IF(M51=\"L\",1,0)+IF(M52=\"L\",1,0)+IF(M53=\"L\",1,0)+IF(M54=\"L\",1,0)+IF(M55=\"L\",1,0)","v":0},{"$f":"IF(M44=\"D\",1,0)+IF(M45=\"D\",1,0)+IF(M46=\"D\",1,0)+IF(M47=\"D\",1,0)+IF(M48=\"D\",1,0)+IF(M49=\"D\",1,0)+IF(M50=\"D\",1,0)+IF(M51=\"D\",1,0)+IF(M52=\"D\",1,0)+IF(M53=\"D\",1,0)+IF(M54=\"D\",1,0)+IF(M55=\"D\",1,0)","v":0},{"$f":"IF(M44=\"W\",1,0)+IF(M45=\"W\",1,0)+IF(M46=\"W\",1,0)+IF(M47=\"W\",1,0)+IF(M48=\"W\",1,0)+IF(M49=\"W\",1,0)+IF(M50=\"W\",1,0)+IF(M51=\"W\",1,0)+IF(M52=\"W\",1,0)+IF(M53=\"W\",1,0)+IF(M54=\"W\",1,0)+IF(M55=\"W\",1,0)","v":0},{"$f":"IF(P44=\"L\",1,0)+IF(P45=\"L\",1,0)+IF(P46=\"L\",1,0)+IF(P47=\"L\",1,0)+IF(P48=\"L\",1,0)+IF(P49=\"L\",1,0)+IF(P50=\"L\",1,0)+IF(P51=\"L\",1,0)+IF(P52=\"L\",1,0)+IF(P53=\"L\",1,0)+IF(P54=\"L\",1,0)+IF(P55=\"L\",1,0)","v":0},{"$f":"IF(P44=\"D\",1,0)+IF(P45=\"D\",1,0)+IF(P46=\"D\",1,0)+IF(P47=\"D\",1,0)+IF(P48=\"D\",1,0)+IF(P49=\"D\",1,0)+IF(P50=\"D\",1,0)+IF(P51=\"D\",1,0)+IF(P52=\"D\",1,0)+IF(P53=\"D\",1,0)+IF(P54=\"D\",1,0)+IF(P55=\"D\",1,0)","v":0},{"$f":"IF(P44=\"W\",1,0)+IF(P45=\"W\",1,0)+IF(P46=\"W\",1,0)+IF(P47=\"W\",1,0)+IF(P48=\"W\",1,0)+IF(P49=\"W\",1,0)+IF(P50=\"W\",1,0)+IF(P51=\"W\",1,0)+IF(P52=\"W\",1,0)+IF(P53=\"W\",1,0)+IF(P54=\"W\",1,0)+IF(P55=\"W\",1,0)","v":0},{"$f":"IF(S44=\"L\",1,0)+IF(S45=\"L\",1,0)+IF(S46=\"L\",1,0)+IF(S47=\"L\",1,0)+IF(S48=\"L\",1,0)+IF(S49=\"L\",1,0)+IF(S50=\"L\",1,0)+IF(S51=\"L\",1,0)+IF(S52=\"L\",1,0)+IF(S53=\"L\",1,0)+IF(S54=\"L\",1,0)+IF(S55=\"L\",1,0)","v":0},{"$f":"IF(S44=\"D\",1,0)+IF(S45=\"D\",1,0)+IF(S46=\"D\",1,0)+IF(S47=\"D\",1,0)+IF(S48=\"D\",1,0)+IF(S49=\"D\",1,0)+IF(S50=\"D\",1,0)+IF(S51=\"D\",1,0)+IF(S52=\"D\",1,0)+IF(S53=\"D\",1,0)+IF(S54=\"D\",1,0)+IF(S55=\"D\",1,0)","v":0},{"$f":"IF(S44=\"W\",1,0)+IF(S45=\"W\",1,0)+IF(S46=\"W\",1,0)+IF(S47=\"W\",1,0)+IF(S48=\"W\",1,0)+IF(S49=\"W\",1,0)+IF(S50=\"W\",1,0)+IF(S51=\"W\",1,0)+IF(S52=\"W\",1,0)+IF(S53=\"W\",1,0)+IF(S54=\"W\",1,0)+IF(S55=\"W\",1,0)","v":0},{"$f":"IF(V44=\"L\",1,0)+IF(V45=\"L\",1,0)+IF(V46=\"L\",1,0)+IF(V47=\"L\",1,0)+IF(V48=\"L\",1,0)+IF(V49=\"L\",1,0)+IF(V50=\"L\",1,0)+IF(V51=\"L\",1,0)+IF(V52=\"L\",1,0)+IF(V53=\"L\",1,0)+IF(V54=\"L\",1,0)+IF(V55=\"L\",1,0)","v":0},{"$f":"IF(V44=\"D\",1,0)+IF(V45=\"D\",1,0)+IF(V46=\"D\",1,0)+IF(V47=\"D\",1,0)+IF(V48=\"D\",1,0)+IF(V49=\"D\",1,0)+IF(V50=\"D\",1,0)+IF(V51=\"D\",1,0)+IF(V52=\"D\",1,0)+IF(V53=\"D\",1,0)+IF(V54=\"D\",1,0)+IF(V55=\"D\",1,0)","v":0},{"$f":"IF(V44=\"W\",1,0)+IF(V45=\"W\",1,0)+IF(V46=\"W\",1,0)+IF(V47=\"W\",1,0)+IF(V48=\"W\",1,0)+IF(V49=\"W\",1,0)+IF(V50=\"W\",1,0)+IF(V51=\"W\",1,0)+IF(V52=\"W\",1,0)+IF(V53=\"W\",1,0)+IF(V54=\"W\",1,0)+IF(V55=\"W\",1,0)","v":0},{"$f":"IF(Y44=\"L\",1,0)+IF(Y45=\"L\",1,0)+IF(Y46=\"L\",1,0)+IF(Y47=\"L\",1,0)+IF(Y48=\"L\",1,0)+IF(Y49=\"L\",1,0)+IF(Y50=\"L\",1,0)+IF(Y51=\"L\",1,0)+IF(Y52=\"L\",1,0)+IF(Y53=\"L\",1,0)+IF(Y54=\"L\",1,0)+IF(Y55=\"L\",1,0)","v":0},{"$f":"IF(Y44=\"D\",1,0)+IF(Y45=\"D\",1,0)+IF(Y46=\"D\",1,0)+IF(Y47=\"D\",1,0)+IF(Y48=\"D\",1,0)+IF(Y49=\"D\",1,0)+IF(Y50=\"D\",1,0)+IF(Y51=\"D\",1,0)+IF(Y52=\"D\",1,0)+IF(Y53=\"D\",1,0)+IF(Y54=\"D\",1,0)+IF(Y55=\"D\",1,0)","v":0},{"$f":"IF(Y44=\"W\",1,0)+IF(Y45=\"W\",1,0)+IF(Y46=\"W\",1,0)+IF(Y47=\"W\",1,0)+IF(Y48=\"W\",1,0)+IF(Y49=\"W\",1,0)+IF(Y50=\"W\",1,0)+IF(Y51=\"W\",1,0)+IF(Y52=\"W\",1,0)+IF(Y53=\"W\",1,0)+IF(Y54=\"W\",1,0)+IF(Y55=\"W\",1,0)","v":0},{"$f":"IF(AB44=\"L\",1,0)+IF(AB45=\"L\",1,0)+IF(AB46=\"L\",1,0)+IF(AB47=\"L\",1,0)+IF(AB48=\"L\",1,0)+IF(AB49=\"L\",1,0)+IF(AB50=\"L\",1,0)+IF(AB51=\"L\",1,0)+IF(AB52=\"L\",1,0)+IF(AB53=\"L\",1,0)+IF(AB54=\"L\",1,0)+IF(AB55=\"L\",1,0)","v":0},{"$f":"IF(AB44=\"D\",1,0)+IF(AB45=\"D\",1,0)+IF(AB46=\"D\",1,0)+IF(AB47=\"D\",1,0)+IF(AB48=\"D\",1,0)+IF(AB49=\"D\",1,0)+IF(AB50=\"D\",1,0)+IF(AB51=\"D\",1,0)+IF(AB52=\"D\",1,0)+IF(AB53=\"D\",1,0)+IF(AB54=\"D\",1,0)+IF(AB55=\"D\",1,0)","v":0},{"$f":"IF(AB44=\"W\",1,0)+IF(AB45=\"W\",1,0)+IF(AB46=\"W\",1,0)+IF(AB47=\"W\",1,0)+IF(AB48=\"W\",1,0)+IF(AB49=\"W\",1,0)+IF(AB50=\"W\",1,0)+IF(AB51=\"W\",1,0)+IF(AB52=\"W\",1,0)+IF(AB53=\"W\",1,0)+IF(AB54=\"W\",1,0)+IF(AB55=\"W\",1,0)","v":0},{"$f":"IF(AE44=\"L\",1,0)+IF(AE45=\"L\",1,0)+IF(AE46=\"L\",1,0)+IF(AE47=\"L\",1,0)+IF(AE48=\"L\",1,0)+IF(AE49=\"L\",1,0)+IF(AE50=\"L\",1,0)+IF(AE51=\"L\",1,0)+IF(AE52=\"L\",1,0)+IF(AE53=\"L\",1,0)+IF(AE54=\"L\",1,0)+IF(AE55=\"L\",1,0)","v":0},{"$f":"IF(AE44=\"D\",1,0)+IF(AE45=\"D\",1,0)+IF(AE46=\"D\",1,0)+IF(AE47=\"D\",1,0)+IF(AE48=\"D\",1,0)+IF(AE49=\"D\",1,0)+IF(AE50=\"D\",1,0)+IF(AE51=\"D\",1,0)+IF(AE52=\"D\",1,0)+IF(AE53=\"D\",1,0)+IF(AE54=\"D\",1,0)+IF(AE55=\"D\",1,0)","v":0},{"$f":"IF(AE44=\"W\",1,0)+IF(AE45=\"W\",1,0)+IF(AE46=\"W\",1,0)+IF(AE47=\"W\",1,0)+IF(AE48=\"W\",1,0)+IF(AE49=\"W\",1,0)+IF(AE50=\"W\",1,0)+IF(AE51=\"W\",1,0)+IF(AE52=\"W\",1,0)+IF(AE53=\"W\",1,0)+IF(AE54=\"W\",1,0)+IF(AE55=\"W\",1,0)","v":0},{"$f":"IF(AH44=\"L\",1,0)+IF(AH45=\"L\",1,0)+IF(AH46=\"L\",1,0)+IF(AH47=\"L\",1,0)+IF(AH48=\"L\",1,0)+IF(AH49=\"L\",1,0)+IF(AH50=\"L\",1,0)+IF(AH51=\"L\",1,0)+IF(AH52=\"L\",1,0)+IF(AH53=\"L\",1,0)+IF(AH54=\"L\",1,0)+IF(AH55=\"L\",1,0)","v":0},{"$f":"IF(AH44=\"D\",1,0)+IF(AH45=\"D\",1,0)+IF(AH46=\"D\",1,0)+IF(AH47=\"D\",1,0)+IF(AH48=\"D\",1,0)+IF(AH49=\"D\",1,0)+IF(AH50=\"D\",1,0)+IF(AH51=\"D\",1,0)+IF(AH52=\"D\",1,0)+IF(AH53=\"D\",1,0)+IF(AH54=\"D\",1,0)+IF(AH55=\"D\",1,0)","v":0},{"$f":"IF(AH44=\"W\",1,0)+IF(AH45=\"W\",1,0)+IF(AH46=\"W\",1,0)+IF(AH47=\"W\",1,0)+IF(AH48=\"W\",1,0)+IF(AH49=\"W\",1,0)+IF(AH50=\"W\",1,0)+IF(AH51=\"W\",1,0)+IF(AH52=\"W\",1,0)+IF(AH53=\"W\",1,0)+IF(AH54=\"W\",1,0)+IF(AH55=\"W\",1,0)","v":0},{"$f":"IF(AK44=\"L\",1,0)+IF(AK45=\"L\",1,0)+IF(AK46=\"L\",1,0)+IF(AK47=\"L\",1,0)+IF(AK48=\"L\",1,0)+IF(AK49=\"L\",1,0)+IF(AK50=\"L\",1,0)+IF(AK51=\"L\",1,0)+IF(AK52=\"L\",1,0)+IF(AK53=\"L\",1,0)+IF(AK54=\"L\",1,0)+IF(AK55=\"L\",1,0)","v":0},{"$f":"IF(AK44=\"D\",1,0)+IF(AK45=\"D\",1,0)+IF(AK46=\"D\",1,0)+IF(AK47=\"D\",1,0)+IF(AK48=\"D\",1,0)+IF(AK49=\"D\",1,0)+IF(AK50=\"D\",1,0)+IF(AK51=\"D\",1,0)+IF(AK52=\"D\",1,0)+IF(AK53=\"D\",1,0)+IF(AK54=\"D\",1,0)+IF(AK55=\"D\",1,0)","v":0},{"$f":"IF(AK44=\"W\",1,0)+IF(AK45=\"W\",1,0)+IF(AK46=\"W\",1,0)+IF(AK47=\"W\",1,0)+IF(AK48=\"W\",1,0)+IF(AK49=\"W\",1,0)+IF(AK50=\"W\",1,0)+IF(AK51=\"W\",1,0)+IF(AK52=\"W\",1,0)+IF(AK53=\"W\",1,0)+IF(AK54=\"W\",1,0)+IF(AK55=\"W\",1,0)","v":0},null,null,null,null,null,null,null,null,null,null,{"$f":"SUM(AV44:AV55)","v":0},0,0,0,0,0,0,0]
[null,"W","D","L","W","D","L","W","D","L","W","D","L","W","D","L","W","D","L","W","D","L","W","D","L","W","D","L","W","D","L","W","D","L","W","D","L",null,null,null,null,null,null,null,null,null,null,{"$f":"IF(AV56=SUM(AW56:AY56),0,1)","v":0},null,{"$f":"AV57+BA57+BC57","v":0},null,null,{"$f":"IF(AZ56=BA56,0,1)","v":0},{"$f":"AW56*3+AX56","v":0},{"$f":"IF(BB56=BB57,0,1)","v":0}]
[null,{"$f":"SUM(C44:C55)","v":0},{"$f":"SUM(B44:B55)","v":0},null,{"$f":"SUM(F44:F55)","v":0},{"$f":"SUM(E44:E55)","v":0},null,{"$f":"SUM(I44:I55)","v":0},{"$f":"SUM(H44:H55)","v":0},null,{"$f":"SUM(L44:L55)","v":0},{"$f":"SUM(K44:K55)","v":0},null,{"$f":"SUM(O44:O55)","v":0},{"$f":"SUM(N44:N55)","v":0},null,{"$f":"SUM(R44:R55)","v":0},{"$f":"SUM(Q44:Q55)","v":0},null,{"$f":"SUM(U44:U55)","v":0},{"$f":"SUM(T44:T55)","v":0},null,{"$f":"SUM(X44:X55)","v":0},{"$f":"SUM(W44:W55)","v":0},null,{"$f":"SUM(AA44:AA55)","v":0},{"$f":"SUM(Z44:Z55)","v":0},null,{"$f":"SUM(AD44:AD55)","v":0},{"$f":"SUM(AC44:AC55)","v":0},null,{"$f":"SUM(AG44:AG55)","v":0},{"$f":"SUM(AF44:AF55)","v":0},null,{"$f":"SUM(AJ44:AJ55)","v":0},{"$f":"SUM(AI44:AI55)","v":0},null,null,null,null,null,null,null,null,null,null,null,"Pld tally",null,"Error Flag",null,null,"Goals tally",null,"Pts tally"]
[null,"F","A",null,"F","A",null,"F","A",null,"F","A",null,"F","A",null,"F","A",null,"F","A",null,"F","A",null,"F","A",null,"F","A",null,"F","A",null,"F","A"]
[]
[{"$f":"A44","v":"Heart of Midlothian"}]
[{"$f":"A45","v":"Motherwell"}]
["Celtic"]
["Dundee United"]
["St Mirren"]
["St Johnstone"]
["Rangers"]
["Ross County"]
["Kilmarnock"]
["Dundee"]
["Hibernian"]
["Aberdeen"]
["Last Five Rounds"]
[{"$f":"IF(AV87=456,\"Final Ladder\",\"(Season Incomplete)\")","v":"(Season Incomplete)"},null,{"$f":"A75","v":"Heart of Midlothian"},null,null,{"$f":"A76","v":"Motherwell"},null,null,{"$f":"A77","v":"Celtic"},null,null,{"$f":"A78","v":"Dundee United"},null,null,{"$f":"A79","v":"St Mirren"},null,null,{"$f":"A80","v":"St Johnstone"},null,null,{"$f":"A81","v":"Rangers"},null,null,{"$f":"A82","v":"Ross County"},null,null,{"$f":"A83","v":"Kilmarnock"},null,null,{"$f":"A84","v":"Dundee"},null,null,{"$f":"A85","v":"Hibernian"},null,null,{"$f":"A86","v":"Aberdeen"},null,"HW","HD","HL","HF","HA","AW","AD","AL","AF","AA","P","W","D","L","F","A","Pts","G/D",{"$f":"BD1","v":"Ddn"}]
[{"$f":"A2","v":"Heart of Midlothian"},null,null,{"$f":"IF(C75=\"\",\"\",IF(B75>C75,\"W\",IF(B75=C75,\"D\",IF(B75<C75,\"L\"))))","v":""},null,null,{"$f":"IF(F75=\"\",\"\",IF(E75>F75,\"W\",IF(E75=F75,\"D\",IF(E75<F75,\"L\"))))","v":""},null,null,{"$f":"IF(I75=\"\",\"\",IF(H75>I75,\"W\",IF(H75=I75,\"D\",IF(H75<I75,\"L\"))))","v":""},null,null,{"$f":"IF(L75=\"\",\"\",IF(K75>L75,\"W\",IF(K75=L75,\"D\",IF(K75<L75,\"L\"))))","v":""},null,null,{"$f":"IF(O75=\"\",\"\",IF(N75>O75,\"W\",IF(N75=O75,\"D\",IF(N75<O75,\"L\"))))","v":""},null,null,{"$f":"IF(R75=\"\",\"\",IF(Q75>R75,\"W\",IF(Q75=R75,\"D\",IF(Q75<R75,\"L\"))))","v":""},null,null,{"$f":"IF(U75=\"\",\"\",IF(T75>U75,\"W\",IF(T75=U75,\"D\",IF(T75<U75,\"L\"))))","v":""},null,null,{"$f":"IF(X75=\"\",\"\",IF(W75>X75,\"W\",IF(W75=X75,\"D\",IF(W75<X75,\"L\"))))","v":""},null,null,{"$f":"IF(AA75=\"\",\"\",IF(Z75>AA75,\"W\",IF(Z75=AA75,\"D\",IF(Z75<AA75,\"L\"))))","v":""},{"$f":"IF(Fixtures!$H$213=\"\",\"\",Fixtures!$H$213)","v":""},{"$f":"IF(Fixtures!$I$213=\"\",\"\",Fixtures!$I$213)","v":""},{"$f":"IF(AD75=\"\",\"\",IF(AC75>AD75,\"W\",IF(AC75=AD75,\"D\",IF(AC75<AD75,\"L\"))))","v":""},{"$f":"IF(Fixtures!$H$218=\"\",\"\",Fixtures!$H$218)","v":""},{"$f":"IF(Fixtures!$I$218=\"\",\"\",Fixtures!$I$218)","v":""},{"$f":"IF(AG75=\"\",\"\",IF(AF75>AG75,\"W\",IF(AF75=AG75,\"D\",IF(AF75<AG75,\"L\"))))","v":""},{"$f":"IF(Fixtures!$H$230=\"\",\"\",Fixtures!$H$230)","v":""},{"$f":"IF(Fixtures!$I$230=\"\",\"\",Fixtures!$I$230)","v":""},{"$f":"IF(AJ75=\"\",\"\",IF(AI75>AJ75,\"W\",IF(AI75=AJ75,\"D\",IF(AI75<AJ75,\"L\"))))","v":""},{"$f":"IF(D75=\"W\",1,0)+IF(G75=\"W\",1,0)+IF(J75=\"W\",1,0)+IF(M75=\"W\",1,0)+IF(P75=\"W\",1,0)+IF(S75=\"W\",1,0)+IF(V75=\"W\",1,0)+IF(Y75=\"W\",1,0)+IF(AB75=\"W\",1,0)+IF(AE75=\"W\",1,0)+IF(AH75=\"W\",1,0)+IF(AK75=\"W\",1,0)","v":0},{"$f":"IF(D75=\"D\",1,0)+IF(G75=\"D\",1,0)+IF(J75=\"D\",1,0)+IF(M75=\"D\",1,0)+IF(P75=\"D\",1,0)+IF(S75=\"D\",1,0)+IF(V75=\"D\",1,0)+IF(Y75=\"D\",1,0)+IF(AB75=\"D\",1,0)+IF(AE75=\"D\",1,0)+IF(AH75=\"D\",1,0)+IF(AK75=\"D\",1,0)","v":0},{"$f":"IF(D75=\"L\",1,0)+IF(G75=\"L\",1,0)+IF(J75=\"L\",1,0)+IF(M75=\"L\",1,0)+IF(P75=\"L\",1,0)+IF(S75=\"L\",1,0)+IF(V75=\"L\",1,0)+IF(Y75=\"L\",1,0)+IF(AB75=\"L\",1,0)+IF(AE75=\"L\",1,0)+IF(AH75=\"L\",1,0)+IF(AK75=\"L\",1,0)","v":0},{"$f":"(IF(B75=\"\",0,B75))+(IF(E75=\"\",0,E75))+(IF(H75=\"\",0,H75))+(IF(K75=\"\",0,K75))+(IF(N75=\"\",0,N75))+(IF(Q75=\"\",0,Q75))+(IF(T75=\"\",0,T75))+(IF(W75=\"\",0,W75))+(IF(Z75=\"\",0,Z75))+(IF(AC75=\"\",0,AC75))+(IF(AF75=\"\",0,AF75))+(IF(AI75=\"\",0,AI75))","v":0},{"$f":"(IF(C75=\"\",0,C75))+(IF(F75=\"\",0,F75))+(IF(I75=\"\",0,I75))+(IF(L75=\"\",0,L75))+(IF(O75=\"\",0,O75))+(IF(R75=\"\",0,R75))+(IF(U75=\"\",0,U75))+(IF(X75=\"\",0,X75))+(IF(AA75=\"\",0,AA75))+(IF(AD75=\"\",0,AD75))+(IF(AG75=\"\",0,AG75))+(IF(AJ75=\"\",0,AJ75))","v":0},{"$f":"B87","v":0},{"$f":"C87","v":0},{"$f":"D87","v":0},{"$f":"B89","v":0},{"$f":"C89","v":0},{"$f":"SUM(AW75:AY75)","v":4},{"$f":"AQ75+AL75+AW2","v":0},{"$f":"AR75+AM75+AX2","v":1},{"$f":"AS75+AN75+AY2","v":3},{"$f":"AT75+AO75+AZ2","v":2},{"$f":"AU75+AP75+BA2","v":7},{"$f":"AW75*3+AX75-BD75","v":1},{"$f":"AZ75-BA75","v":-5},{"$f":"BD2","v":0}]
[{"$f":"A3","v":"Motherwell"},{"$f":"IF(Fixtures!$H$211=\"\",\"\",Fixtures!$H$211)","v":""},{"$f":"IF(Fixtures!$I$211=\"\",\"\",Fixtures!$I$211)","v":""},"",null,null,"",null,null,{"$f":"IF(I76=\"\",\"\",IF(H76>I76,\"W\",IF(H76=I76,\"D\",IF(H76<I76,\"L\"))))","v":""},null,null,"",{"$f":"IF(Fixtures!$H$231=\"\",\"\",Fixtures!$H$231)","v":""},{"$f":"IF(Fixtures!$I$231=\"\",\"\",Fixtures!$I$231)","v":""},"",null,null,"",null,null,"",null,null,"",null,null,"",null,null,"",null,null,"",{"$f":"IF(Fixtures!$H$214=\"\",\"\",Fixtures!$H$214)","v":""},{"$f":"IF(Fixtures!$I$214=\"\",\"\",Fixtures!$I$214)","v":""},"",{"$f":"IF(D76=\"W\",1,0)+IF(G76=\"W\",1,0)+IF(J76=\"W\",1,0)+IF(M76=\"W\",1,0)+IF(P76=\"W\",1,0)+IF(S76=\"W\",1,0)+IF(V76=\"W\",1,0)+IF(Y76=\"W\",1,0)+IF(AB76=\"W\",1,0)+IF(AE76=\"W\",1,0)+IF(AH76=\"W\",1,0)+IF(AK76=\"W\",1,0)","v":0},{"$f":"IF(D76=\"D\",1,0)+IF(G76=\"D\",1,0)+IF(J76=\"D\",1,0)+IF(M76=\"D\",1,0)+IF(P76=\"D\",1,0)+IF(S76=\"D\",1,0)+IF(V76=\"D\",1,0)+IF(Y76=\"D\",1,0)+IF(AB76=\"D\",1,0)+IF(AE76=\"D\",1,0)+IF(AH76=\"D\",1,0)+IF(AK76=\"D\",1,0)","v":0},{"$f":"IF(D76=\"L\",1,0)+IF(G76=\"L\",1,0)+IF(J76=\"L\",1,0)+IF(M76=\"L\",1,0)+IF(P76=\"L\",1,0)+IF(S76=\"L\",1,0)+IF(V76=\"L\",1,0)+IF(Y76=\"L\",1,0)+IF(AB76=\"L\",1,0)+IF(AE76=\"L\",1,0)+IF(AH76=\"L\",1,0)+IF(AK76=\"L\",1,0)","v":0},{"$f":"(IF(B76=\"\",0,B76))+(IF(E76=\"\",0,E76))+(IF(H76=\"\",0,H76))+(IF(K76=\"\",0,K76))+(IF(N76=\"\",0,N76))+(IF(Q76=\"\",0,Q76))+(IF(T76=\"\",0,T76))+(IF(W76=\"\",0,W76))+(IF(Z76=\"\",0,Z76))+(IF(AC76=\"\",0,AC76))+(IF(AF76=\"\",0,AF76))+(IF(AI76=\"\",0,AI76))","v":0},{"$f":"(IF(C76=\"\",0,C76))+(IF(F76=\"\",0,F76))+(IF(I76=\"\",0,I76))+(IF(L76=\"\",0,L76))+(IF(O76=\"\",0,O76))+(IF(R76=\"\",0,R76))+(IF(U76=\"\",0,U76))+(IF(X76=\"\",0,X76))+(IF(AA76=\"\",0,AA76))+(IF(AD76=\"\",0,AD76))+(IF(AG76=\"\",0,AG76))+(IF(AJ76=\"\",0,AJ76))","v":0},{"$f":"E87","v":0},{"$f":"F87","v":0},{"$f":"G87","v":0},{"$f":"E89","v":0},{"$f":"F89","v":0},{"$f":"SUM(AW76:AY76)","v":4},{"$f":"AQ76+AL76+AW3","v":2},1,1,6,4,7,2,0]
["Celtic",null,null,"",null,null,"",null,null,"",{"$f":"IF(Fixtures!$H$220=\"\",\"\",Fixtures!$H$220)","v":""},{"$f":"IF(Fixtures!$I$220=\"\",\"\",Fixtures!$I$220)","v":""},"",null,null,"",{"$f":"IF(Fixtures!$H$233=\"\",\"\",Fixtures!$H$233)","v":""},{"$f":"IF(Fixtures!$I$233=\"\",\"\",Fixtures!$I$233)","v":""},"",{"$f":"IF(Fixtures!$H$208=\"\",\"\",Fixtures!$H$208)","v":""},{"$f":"IF(Fixtures!$I$208=\"\",\"\",Fixtures!$I$208)","v":""},"",null,null,"",null,null,"",null,null,"",null,null,"",null,null,"",{"$f":"IF(D77=\"W\",1,0)+IF(G77=\"W\",1,0)+IF(J77=\"W\",1,0)+IF(M77=\"W\",1,0)+IF(P77=\"W\",1,0)+IF(S77=\"W\",1,0)+IF(V77=\"W\",1,0)+IF(Y77=\"W\",1,0)+IF(AB77=\"W\",1,0)+IF(AE77=\"W\",1,0)+IF(AH77=\"W\",1,0)+IF(AK77=\"W\",1,0)","v":0},0,{"$f":"IF(D77=\"L\",1,0)+IF(G77=\"L\",1,0)+IF(J77=\"L\",1,0)+IF(M77=\"L\",1,0)+IF(P77=\"L\",1,0)+IF(S77=\"L\",1,0)+IF(V77=\"L\",1,0)+IF(Y77=\"L\",1,0)+IF(AB77=\"L\",1,0)+IF(AE77=\"L\",1,0)+IF(AH77=\"L\",1,0)+IF(AK77=\"L\",1,0)","v":0},0,{"$f":"(IF(C77=\"\",0,C77))+(IF(F77=\"\",0,F77))+(IF(I77=\"\",0,I77))+(IF(L77=\"\",0,L77))+(IF(O77=\"\",0,O77))+(IF(R77=\"\",0,R77))+(IF(U77=\"\",0,U77))+(IF(X77=\"\",0,X77))+(IF(AA77=\"\",0,AA77))+(IF(AD77=\"\",0,AD77))+(IF(AG77=\"\",0,AG77))+(IF(AJ77=\"\",0,AJ77))","v":0},{"$f":"H87","v":0},{"$f":"I87","v":0},{"$f":"J87","v":0},{"$f":"H89","v":0},{"$f":"I89","v":0},4,4,0,0,12,0,12,12,0]
["Dundee United",null,null,"",null,null,"",null,null,"",null,null,"",null,null,"",{"$f":"IF(Fixtures!$H$209=\"\",\"\",Fixtures!$H$209)","v":""},{"$f":"IF(Fixtures!$I$209=\"\",\"\",Fixtures!$I$209)","v":""},"",{"$f":"IF(Fixtures!$H$228=\"\",\"\",Fixtures!$H$228)","v":""},{"$f":"IF(Fixtures!$I$228=\"\",\"\",Fixtures!$I$228)","v":""},"",null,null,"",null,null,"",null,null,"",null,null,"",null,null,"",0,0,0,0,0,{"$f":"K87","v":0},{"$f":"L87","v":0},{"$f":"M87","v":0},{"$f":"K89","v":0},{"$f":"L89","v":0},4,2,2,0,6,3,8,3,0]
["St Mirren",{"$f":"IF(Fixtures!$H$225=\"\",\"\",Fixtures!$H$225)","v":""},{"$f":"IF(Fixtures!$I$225=\"\",\"\",Fixtures!$I$225)","v":""},"",null,null,"",null,null,"",null,null,"",null,null,"",null,null,"",null,null,"",null,null,"",null,null,"",{"$f":"IF(Fixtures!$H$207=\"\",\"\",Fixtures!$H$207)","v":""},{"$f":"IF(Fixtures!$I$207=\"\",\"\",Fixtures!$I$207)","v":""},"",null,null,"",null,null,"",0,0,0,0,0,{"$f":"N87","v":0},{"$f":"O87","v":0},{"$f":"P87","v":0},{"$f":"N89","v":0},{"$f":"O89","v":0},4,1,1,2,6,8,4,-2,0]
["St Johnstone",null,null,"",null,null,"",null,null,"",null,null,"",null,null,"",null,null,"",null,null,"",{"$f":"IF(Fixtures!$H$227=\"\",\"\",Fixtures!$H$227)","v":""},{"$f":"IF(Fixtures!$I$227=\"\",\"\",Fixtures!$I$227)","v":""},"",{"$f":"IF(Fixtures!$H$223=\"\",\"\",Fixtures!$H$223)","v":""},{"$f":"IF(Fixtures!$I$223=\"\",\"\",Fixtures!$I$223)","v":""},"",null,null,"",null,null,"",null,null,"",0,0,0,0,0,{"$f":"Q87","v":0},{"$f":"R87","v":0},{"$f":"S87","v":0},{"$f":"Q89","v":0},{"$f":"R89","v":0},4,1,0,3,5,6,3,-1,0]
["Rangers",null,null,"",null,null,"",null,null,"",null,null,"",null,null,"",{"$f":"IF(Fixtures!$H$216=\"\",\"\",Fixtures!$H$216)","v":""},{"$f":"IF(Fixtures!$I$216=\"\",\"\",Fixtures!$I$216)","v":""},"",null,null,"",{"$f":"IF(Fixtures!$H$221=\"\",\"\",Fixtures!$H$221)","v":""},{"$f":"IF(Fixtures!$I$221=\"\",\"\",Fixtures!$I$221)","v":""},"",{"$f":"IF(Fixtures!$H$235=\"\",\"\",Fixtures!$H$235)","v":""},{"$f":"IF(Fixtures!$I$235=\"\",\"\",Fixtures!$I$235)","v":""},"",null,null,"",null,null,"",null,null,"",0,0,0,0,0,{"$f":"T87","v":0},{"$f":"U87","v":0},{"$f":"V87","v":0},{"$f":"T89","v":0},{"$f":"U89","v":0},4,2,1,1,8,4,7,4,0]
["Ross County",null,null,"",null,null,"",{"$f":"IF(Fixtures!$H$215=\"\",\"\",Fixtures!$H$215)","v":""},{"$f":"IF(Fixtures!$I$215=\"\",\"\",Fixtures!$I$215)","v":""},"",{"$f":"IF(Fixtures!$H$234=\"\",\"\",Fixtures!$H$234)","v":""},{"$f":"IF(Fixtures!$I$234=\"\",\"\",Fixtures!$I$234)","v":""},"",null,null,"",null,null,"",null,null,"",null,null,"",null,null,"",null,null,"",null,null,"",null,null,"",0,0,0,0,0,{"$f":"W87","v":0},{"$f":"X87","v":0},{"$f":"Y87","v":0},{"$f":"W89","v":0},{"$f":"X89","v":0},4,0,2,2,1,8,2,-7,0]
["Kilmarnock",null,null,"",null,null,"",{"$f":"IF(Fixtures!$H$226=\"\",\"\",Fixtures!$H$226)","v":""},{"$f":"IF(Fixtures!$I$226=\"\",\"\",Fixtures!$I$226)","v":""},"",{"$f":"IF(Fixtures!$H$212=\"\",\"\",Fixtures!$H$212)","v":""},{"$f":"IF(Fixtures!$I$212=\"\",\"\",Fixtures!$I$212)","v":""},"",null,null,"",null,null,"",null,null,"",{"$f":"IF(Fixtures!$H$206=\"\",\"\",Fixtures!$H$206)","v":""},{"$f":"IF(Fixtures!$I$206=\"\",\"\",Fixtures!$I$206)","v":""},"",null,null,"",null,null,"",null,null,"",null,null,"",0,0,0,0,0,{"$f":"Z87","v":0},{"$f":"AA87","v":0},{"$f":"AB87","v":0},{"$f":"Z89","v":0},{"$f":"AA89","v":0},4,0,1,3,1,10,1,-9,0]
["Dundee",null,null,"",{"$f":"IF(Fixtures!$H$219=\"\",\"\",Fixtures!$H$219)","v":""},{"$f":"IF(Fixtures!$I$219=\"\",\"\",Fixtures!$I$219)","v":""},"",null,null,"",null,null,"",null,null,"",null,null,"",null,null,"",null,null,"",null,null,"",null,null,"",{"$f":"IF(Fixtures!$H$232=\"\",\"\",Fixtures!$H$232)","v":""},{"$f":"IF(Fixtures!$I$232=\"\",\"\",Fixtures!$I$232)","v":""},"",null,null,"",0,0,0,0,0,{"$f":"AC87","v":0},{"$f":"AD87","v":0},{"$f":"AE87","v":0},{"$f":"AC89","v":0},{"$f":"AD89","v":0},4,1,3,0,9,7,6,2,0]
["Hibernian",null,null,"",{"$f":"IF(Fixtures!$H$224=\"\",\"\",Fixtures!$H$224)","v":""},{"$f":"IF(Fixtures!$I$224=\"\",\"\",Fixtures!$I$224)","v":""},"",null,null,"",null,null,"",{"$f":"IF(Fixtures!$H$217=\"\",\"\",Fixtures!$H$217)","v":""},{"$f":"IF(Fixtures!$I$217=\"\",\"\",Fixtures!$I$217)","v":""},"",null,null,"",null,null,"",null,null,"",null,null,"",null,null,"",null,null,"",null,null,"",0,0,0,0,0,{"$f":"AF87","v":0},{"$f":"AG87","v":0},{"$f":"AH87","v":0},{"$f":"AF89","v":0},{"$f":"AG89","v":0},4,0,2,2,3,8,2,-5,0]
["Aberdeen",null,null,"",null,null,"",null,null,"",null,null,"",{"$f":"IF(Fixtures!$H$222=\"\",\"\",Fixtures!$H$222)","v":""},{"$f":"IF(Fixtures!$I$222=\"\",\"\",Fixtures!$I$222)","v":""},"",null,null,"",null,null,"",null,null,"",null,null,"",{"$f":"IF(Fixtures!$H$229=\"\",\"\",Fixtures!$H$229)","v":""},{"$f":"IF(Fixtures!$I$229=\"\",\"\",Fixtures!$I$229)","v":""},"",{"$f":"IF(Fixtures!$H$210=\"\",\"\",Fixtures!$H$210)","v":""},{"$f":"IF(Fixtures!$I$210=\"\",\"\",Fixtures!$I$210)","v":""},"",null,null,"",{"$f":"IF(D86=\"W\",1,0)+IF(G86=\"W\",1,0)+IF(J86=\"W\",1,0)+IF(M86=\"W\",1,0)+IF(P86=\"W\",1,0)+IF(S86=\"W\",1,0)+IF(V86=\"W\",1,0)+IF(Y86=\"W\",1,0)+IF(AB86=\"W\",1,0)+IF(AE86=\"W\",1,0)+IF(AH86=\"W\",1,0)+IF(AK86=\"W\",1,0)","v":0},{"$f":"IF(D86=\"D\",1,0)+IF(G86=\"D\",1,0)+IF(J86=\"D\",1,0)+IF(M86=\"D\",1,0)+IF(P86=\"D\",1,0)+IF(S86=\"D\",1,0)+IF(V86=\"D\",1,0)+IF(Y86=\"D\",1,0)+IF(AB86=\"D\",1,0)+IF(AE86=\"D\",1,0)+IF(AH86=\"D\",1,0)+IF(AK86=\"D\",1,0)","v":0},{"$f":"IF(D86=\"L\",1,0)+IF(G86=\"L\",1,0)+IF(J86=\"L\",1,0)+IF(M86=\"L\",1,0)+IF(P86=\"L\",1,0)+IF(S86=\"L\",1,0)+IF(V86=\"L\",1,0)+IF(Y86=\"L\",1,0)+IF(AB86=\"L\",1,0)+IF(AE86=\"L\",1,0)+IF(AH86=\"L\",1,0)+IF(AK86=\"L\",1,0)","v":0},0,0,{"$f":"AI87","v":0},{"$f":"AJ87","v":0},{"$f":"AK87","v":0},{"$f":"AI89","v":0},{"$f":"AJ89","v":0},4,4,0,0,8,2,12,6,0]
[null,{"$f":"IF(D75=\"L\",1,0)+IF(D76=\"L\",1,0)+IF(D77=\"L\",1,0)+IF(D78=\"L\",1,0)+IF(D79=\"L\",1,0)+IF(D80=\"L\",1,0)+IF(D81=\"L\",1,0)+IF(D82=\"L\",1,0)+IF(D83=\"L\",1,0)+IF(D84=\"L\",1,0)+IF(D85=\"L\",1,0)+IF(D86=\"L\",1,0)","v":0},{"$f":"IF(D75=\"D\",1,0)+IF(D76=\"D\",1,0)+IF(D77=\"D\",1,0)+IF(D78=\"D\",1,0)+IF(D79=\"D\",1,0)+IF(D80=\"D\",1,0)+IF(D81=\"D\",1,0)+IF(D82=\"D\",1,0)+IF(D83=\"D\",1,0)+IF(D84=\"D\",1,0)+IF(D85=\"D\",1,0)+IF(D86=\"D\",1,0)","v":0},{"$f":"IF(D75=\"W\",1,0)+IF(D76=\"W\",1,0)+IF(D77=\"W\",1,0)+IF(D78=\"W\",1,0)+IF(D79=\"W\",1,0)+IF(D80=\"W\",1,0)+IF(D81=\"W\",1,0)+IF(D82=\"W\",1,0)+IF(D83=\"W\",1,0)+IF(D84=\"W\",1,0)+IF(D85=\"W\",1,0)+IF(D86=\"W\",1,0)","v":0},{"$f":"IF(G75=\"L\",1,0)+IF(G76=\"L\",1,0)+IF(G77=\"L\",1,0)+IF(G78=\"L\",1,0)+IF(G79=\"L\",1,0)+IF(G80=\"L\",1,0)+IF(G81=\"L\",1,0)+IF(G82=\"L\",1,0)+IF(G83=\"L\",1,0)+IF(G84=\"L\",1,0)+IF(G85=\"L\",1,0)+IF(G86=\"L\",1,0)","v":0},{"$f":"IF(G75=\"D\",1,0)+IF(G76=\"D\",1,0)+IF(G77=\"D\",1,0)+IF(G78=\"D\",1,0)+IF(G79=\"D\",1,0)+IF(G80=\"D\",1,0)+IF(G81=\"D\",1,0)+IF(G82=\"D\",1,0)+IF(G83=\"D\",1,0)+IF(G84=\"D\",1,0)+IF(G85=\"D\",1,0)+IF(G86=\"D\",1,0)","v":0},{"$f":"IF(G75=\"W\",1,0)+IF(G76=\"W\",1,0)+IF(G77=\"W\",1,0)+IF(G78=\"W\",1,0)+IF(G79=\"W\",1,0)+IF(G80=\"W\",1,0)+IF(G81=\"W\",1,0)+IF(G82=\"W\",1,0)+IF(G83=\"W\",1,0)+IF(G84=\"W\",1,0)+IF(G85=\"W\",1,0)+IF(G86=\"W\",1,0)","v":0},{"$f":"IF(J75=\"L\",1,0)+IF(J76=\"L\",1,0)+IF(J77=\"L\",1,0)+IF(J78=\"L\",1,0)+IF(J79=\"L\",1,0)+IF(J80=\"L\",1,0)+IF(J81=\"L\",1,0)+IF(J82=\"L\",1,0)+IF(J83=\"L\",1,0)+IF(J84=\"L\",1,0)+IF(J85=\"L\",1,0)+IF(J86=\"L\",1,0)","v":0},{"$f":"IF(J75=\"D\",1,0)+IF(J76=\"D\",1,0)+IF(J77=\"D\",1,0)+IF(J78=\"D\",1,0)+IF(J79=\"D\",1,0)+IF(J80=\"D\",1,0)+IF(J81=\"D\",1,0)+IF(J82=\"D\",1,0)+IF(J83=\"D\",1,0)+IF(J84=\"D\",1,0)+IF(J85=\"D\",1,0)+IF(J86=\"D\",1,0)","v":0},{"$f":"IF(J75=\"W\",1,0)+IF(J76=\"W\",1,0)+IF(J77=\"W\",1,0)+IF(J78=\"W\",1,0)+IF(J79=\"W\",1,0)+IF(J80=\"W\",1,0)+IF(J81=\"W\",1,0)+IF(J82=\"W\",1,0)+IF(J83=\"W\",1,0)+IF(J84=\"W\",1,0)+IF(J85=\"W\",1,0)+IF(J86=\"W\",1,0)","v":0},{"$f":"IF(M75=\"L\",1,0)+IF(M76=\"L\",1,0)+IF(M77=\"L\",1,0)+IF(M78=\"L\",1,0)+IF(M79=\"L\",1,0)+IF(M80=\"L\",1,0)+IF(M81=\"L\",1,0)+IF(M82=\"L\",1,0)+IF(M83=\"L\",1,0)+IF(M84=\"L\",1,0)+IF(M85=\"L\",1,0)+IF(M86=\"L\",1,0)","v":0},{"$f":"IF(M75=\"D\",1,0)+IF(M76=\"D\",1,0)+IF(M77=\"D\",1,0)+IF(M78=\"D\",1,0)+IF(M79=\"D\",1,0)+IF(M80=\"D\",1,0)+IF(M81=\"D\",1,0)+IF(M82=\"D\",1,0)+IF(M83=\"D\",1,0)+IF(M84=\"D\",1,0)+IF(M85=\"D\",1,0)+IF(M86=\"D\",1,0)","v":0},{"$f":"IF(M75=\"W\",1,0)+IF(M76=\"W\",1,0)+IF(M77=\"W\",1,0)+IF(M78=\"W\",1,0)+IF(M79=\"W\",1,0)+IF(M80=\"W\",1,0)+IF(M81=\"W\",1,0)+IF(M82=\"W\",1,0)+IF(M83=\"W\",1,0)+IF(M84=\"W\",1,0)+IF(M85=\"W\",1,0)+IF(M86=\"W\",1,0)","v":0},{"$f":"IF(P75=\"L\",1,0)+IF(P76=\"L\",1,0)+IF(P77=\"L\",1,0)+IF(P78=\"L\",1,0)+IF(P79=\"L\",1,0)+IF(P80=\"L\",1,0)+IF(P81=\"L\",1,0)+IF(P82=\"L\",1,0)+IF(P83=\"L\",1,0)+IF(P84=\"L\",1,0)+IF(P85=\"L\",1,0)+IF(P86=\"L\",1,0)","v":0},{"$f":"IF(P75=\"D\",1,0)+IF(P76=\"D\",1,0)+IF(P77=\"D\",1,0)+IF(P78=\"D\",1,0)+IF(P79=\"D\",1,0)+IF(P80=\"D\",1,0)+IF(P81=\"D\",1,0)+IF(P82=\"D\",1,0)+IF(P83=\"D\",1,0)+IF(P84=\"D\",1,0)+IF(P85=\"D\",1,0)+IF(P86=\"D\",1,0)","v":0},{"$f":"IF(P75=\"W\",1,0)+IF(P76=\"W\",1,0)+IF(P77=\"W\",1,0)+IF(P78=\"W\",1,0)+IF(P79=\"W\",1,0)+IF(P80=\"W\",1,0)+IF(P81=\"W\",1,0)+IF(P82=\"W\",1,0)+IF(P83=\"W\",1,0)+IF(P84=\"W\",1,0)+IF(P85=\"W\",1,0)+IF(P86=\"W\",1,0)","v":0},{"$f":"IF(S75=\"L\",1,0)+IF(S76=\"L\",1,0)+IF(S77=\"L\",1,0)+IF(S78=\"L\",1,0)+IF(S79=\"L\",1,0)+IF(S80=\"L\",1,0)+IF(S81=\"L\",1,0)+IF(S82=\"L\",1,0)+IF(S83=\"L\",1,0)+IF(S84=\"L\",1,0)+IF(S85=\"L\",1,0)+IF(S86=\"L\",1,0)","v":0},{"$f":"IF(S75=\"D\",1,0)+IF(S76=\"D\",1,0)+IF(S77=\"D\",1,0)+IF(S78=\"D\",1,0)+IF(S79=\"D\",1,0)+IF(S80=\"D\",1,0)+IF(S81=\"D\",1,0)+IF(S82=\"D\",1,0)+IF(S83=\"D\",1,0)+IF(S84=\"D\",1,0)+IF(S85=\"D\",1,0)+IF(S86=\"D\",1,0)","v":0},{"$f":"IF(S75=\"W\",1,0)+IF(S76=\"W\",1,0)+IF(S77=\"W\",1,0)+IF(S78=\"W\",1,0)+IF(S79=\"W\",1,0)+IF(S80=\"W\",1,0)+IF(S81=\"W\",1,0)+IF(S82=\"W\",1,0)+IF(S83=\"W\",1,0)+IF(S84=\"W\",1,0)+IF(S85=\"W\",1,0)+IF(S86=\"W\",1,0)","v":0},{"$f":"IF(V75=\"L\",1,0)+IF(V76=\"L\",1,0)+IF(V77=\"L\",1,0)+IF(V78=\"L\",1,0)+IF(V79=\"L\",1,0)+IF(V80=\"L\",1,0)+IF(V81=\"L\",1,0)+IF(V82=\"L\",1,0)+IF(V83=\"L\",1,0)+IF(V84=\"L\",1,0)+IF(V85=\"L\",1,0)+IF(V86=\"L\",1,0)","v":0},{"$f":"IF(V75=\"D\",1,0)+IF(V76=\"D\",1,0)+IF(V77=\"D\",1,0)+IF(V78=\"D\",1,0)+IF(V79=\"D\",1,0)+IF(V80=\"D\",1,0)+IF(V81=\"D\",1,0)+IF(V82=\"D\",1,0)+IF(V83=\"D\",1,0)+IF(V84=\"D\",1,0)+IF(V85=\"D\",1,0)+IF(V86=\"D\",1,0)","v":0},{"$f":"IF(V75=\"W\",1,0)+IF(V76=\"W\",1,0)+IF(V77=\"W\",1,0)+IF(V78=\"W\",1,0)+IF(V79=\"W\",1,0)+IF(V80=\"W\",1,0)+IF(V81=\"W\",1,0)+IF(V82=\"W\",1,0)+IF(V83=\"W\",1,0)+IF(V84=\"W\",1,0)+IF(V85=\"W\",1,0)+IF(V86=\"W\",1,0)","v":0},{"$f":"IF(Y75=\"L\",1,0)+IF(Y76=\"L\",1,0)+IF(Y77=\"L\",1,0)+IF(Y78=\"L\",1,0)+IF(Y79=\"L\",1,0)+IF(Y80=\"L\",1,0)+IF(Y81=\"L\",1,0)+IF(Y82=\"L\",1,0)+IF(Y83=\"L\",1,0)+IF(Y84=\"L\",1,0)+IF(Y85=\"L\",1,0)+IF(Y86=\"L\",1,0)","v":0},{"$f":"IF(Y75=\"D\",1,0)+IF(Y76=\"D\",1,0)+IF(Y77=\"D\",1,0)+IF(Y78=\"D\",1,0)+IF(Y79=\"D\",1,0)+IF(Y80=\"D\",1,0)+IF(Y81=\"D\",1,0)+IF(Y82=\"D\",1,0)+IF(Y83=\"D\",1,0)+IF(Y84=\"D\",1,0)+IF(Y85=\"D\",1,0)+IF(Y86=\"D\",1,0)","v":0},{"$f":"IF(Y75=\"W\",1,0)+IF(Y76=\"W\",1,0)+IF(Y77=\"W\",1,0)+IF(Y78=\"W\",1,0)+IF(Y79=\"W\",1,0)+IF(Y80=\"W\",1,0)+IF(Y81=\"W\",1,0)+IF(Y82=\"W\",1,0)+IF(Y83=\"W\",1,0)+IF(Y84=\"W\",1,0)+IF(Y85=\"W\",1,0)+IF(Y86=\"W\",1,0)","v":0},{"$f":"IF(AB75=\"L\",1,0)+IF(AB76=\"L\",1,0)+IF(AB77=\"L\",1,0)+IF(AB78=\"L\",1,0)+IF(AB79=\"L\",1,0)+IF(AB80=\"L\",1,0)+IF(AB81=\"L\",1,0)+IF(AB82=\"L\",1,0)+IF(AB83=\"L\",1,0)+IF(AB84=\"L\",1,0)+IF(AB85=\"L\",1,0)+IF(AB86=\"L\",1,0)","v":0},{"$f":"IF(AB75=\"D\",1,0)+IF(AB76=\"D\",1,0)+IF(AB77=\"D\",1,0)+IF(AB78=\"D\",1,0)+IF(AB79=\"D\",1,0)+IF(AB80=\"D\",1,0)+IF(AB81=\"D\",1,0)+IF(AB82=\"D\",1,0)+IF(AB83=\"D\",1,0)+IF(AB84=\"D\",1,0)+IF(AB85=\"D\",1,0)+IF(AB86=\"D\",1,0)","v":0},{"$f":"IF(AB75=\"W\",1,0)+IF(AB76=\"W\",1,0)+IF(AB77=\"W\",1,0)+IF(AB78=\"W\",1,0)+IF(AB79=\"W\",1,0)+IF(AB80=\"W\",1,0)+IF(AB81=\"W\",1,0)+IF(AB82=\"W\",1,0)+IF(AB83=\"W\",1,0)+IF(AB84=\"W\",1,0)+IF(AB85=\"W\",1,0)+IF(AB86=\"W\",1,0)","v":0},{"$f":"IF(AE75=\"L\",1,0)+IF(AE76=\"L\",1,0)+IF(AE77=\"L\",1,0)+IF(AE78=\"L\",1,0)+IF(AE79=\"L\",1,0)+IF(AE80=\"L\",1,0)+IF(AE81=\"L\",1,0)+IF(AE82=\"L\",1,0)+IF(AE83=\"L\",1,0)+IF(AE84=\"L\",1,0)+IF(AE85=\"L\",1,0)+IF(AE86=\"L\",1,0)","v":0},{"$f":"IF(AE75=\"D\",1,0)+IF(AE76=\"D\",1,0)+IF(AE77=\"D\",1,0)+IF(AE78=\"D\",1,0)+IF(AE79=\"D\",1,0)+IF(AE80=\"D\",1,0)+IF(AE81=\"D\",1,0)+IF(AE82=\"D\",1,0)+IF(AE83=\"D\",1,0)+IF(AE84=\"D\",1,0)+IF(AE85=\"D\",1,0)+IF(AE86=\"D\",1,0)","v":0},{"$f":"IF(AE75=\"W\",1,0)+IF(AE76=\"W\",1,0)+IF(AE77=\"W\",1,0)+IF(AE78=\"W\",1,0)+IF(AE79=\"W\",1,0)+IF(AE80=\"W\",1,0)+IF(AE81=\"W\",1,0)+IF(AE82=\"W\",1,0)+IF(AE83=\"W\",1,0)+IF(AE84=\"W\",1,0)+IF(AE85=\"W\",1,0)+IF(AE86=\"W\",1,0)","v":0},{"$f":"IF(AH75=\"L\",1,0)+IF(AH76=\"L\",1,0)+IF(AH77=\"L\",1,0)+IF(AH78=\"L\",1,0)+IF(AH79=\"L\",1,0)+IF(AH80=\"L\",1,0)+IF(AH81=\"L\",1,0)+IF(AH82=\"L\",1,0)+IF(AH83=\"L\",1,0)+IF(AH84=\"L\",1,0)+IF(AH85=\"L\",1,0)+IF(AH86=\"L\",1,0)","v":0},{"$f":"IF(AH75=\"D\",1,0)+IF(AH76=\"D\",1,0)+IF(AH77=\"D\",1,0)+IF(AH78=\"D\",1,0)+IF(AH79=\"D\",1,0)+IF(AH80=\"D\",1,0)+IF(AH81=\"D\",1,0)+IF(AH82=\"D\",1,0)+IF(AH83=\"D\",1,0)+IF(AH84=\"D\",1,0)+IF(AH85=\"D\",1,0)+IF(AH86=\"D\",1,0)","v":0},{"$f":"IF(AH75=\"W\",1,0)+IF(AH76=\"W\",1,0)+IF(AH77=\"W\",1,0)+IF(AH78=\"W\",1,0)+IF(AH79=\"W\",1,0)+IF(AH80=\"W\",1,0)+IF(AH81=\"W\",1,0)+IF(AH82=\"W\",1,0)+IF(AH83=\"W\",1,0)+IF(AH84=\"W\",1,0)+IF(AH85=\"W\",1,0)+IF(AH86=\"W\",1,0)","v":0},{"$f":"IF(AK75=\"L\",1,0)+IF(AK76=\"L\",1,0)+IF(AK77=\"L\",1,0)+IF(AK78=\"L\",1,0)+IF(AK79=\"L\",1,0)+IF(AK80=\"L\",1,0)+IF(AK81=\"L\",1,0)+IF(AK82=\"L\",1,0)+IF(AK83=\"L\",1,0)+IF(AK84=\"L\",1,0)+IF(AK85=\"L\",1,0)+IF(AK86=\"L\",1,0)","v":0},{"$f":"IF(AK75=\"D\",1,0)+IF(AK76=\"D\",1,0)+IF(AK77=\"D\",1,0)+IF(AK78=\"D\",1,0)+IF(AK79=\"D\",1,0)+IF(AK80=\"D\",1,0)+IF(AK81=\"D\",1,0)+IF(AK82=\"D\",1,0)+IF(AK83=\"D\",1,0)+IF(AK84=\"D\",1,0)+IF(AK85=\"D\",1,0)+IF(AK86=\"D\",1,0)","v":0},{"$f":"IF(AK75=\"W\",1,0)+IF(AK76=\"W\",1,0)+IF(AK77=\"W\",1,0)+IF(AK78=\"W\",1,0)+IF(AK79=\"W\",1,0)+IF(AK80=\"W\",1,0)+IF(AK81=\"W\",1,0)+IF(AK82=\"W\",1,0)+IF(AK83=\"W\",1,0)+IF(AK84=\"W\",1,0)+IF(AK85=\"W\",1,0)+IF(AK86=\"W\",1,0)","v":0},null,null,null,null,null,null,null,null,null,null,{"$f":"SUM(AV75:AV86)","v":48},17,14,17,67,67,65,0]
[null,"W","D","L","W","D","L","W","D","L","W","D","L","W","D","L","W","D","L","W","D","L","W","D","L","W","D","L","W","D","L","W","D","L","W","D","L",null,null,null,null,null,null,null,null,null,null,{"$f":"IF(AV87=SUM(AW87:AY87),0,1)","v":0},null,{"$f":"AV88+BA88+BC88","v":0},null,null,{"$f":"IF(AZ87=BA87,0,1)","v":0},{"$f":"AW87*3+AX87","v":65},{"$f":"IF(BB87=BB88,0,1)","v":0}]
[null,{"$f":"SUM(C75:C86)","v":0},{"$f":"SUM(B75:B86)","v":0},null,{"$f":"SUM(F75:F86)","v":0},{"$f":"SUM(E75:E86)","v":0},null,{"$f":"SUM(I75:I86)","v":0},{"$f":"SUM(H75:H86)","v":0},null,{"$f":"SUM(L75:L86)","v":0},{"$f":"SUM(K75:K86)","v":0},null,{"$f":"SUM(O75:O86)","v":0},{"$f":"SUM(N75:N86)","v":0},null,{"$f":"SUM(R75:R86)","v":0},{"$f":"SUM(Q75:Q86)","v":0},null,{"$f":"SUM(U75:U86)","v":0},{"$f":"SUM(T75:T86)","v":0},null,{"$f":"SUM(X75:X86)","v":0},{"$f":"SUM(W75:W86)","v":0},null,{"$f":"SUM(AA75:AA86)","v":0},{"$f":"SUM(Z75:Z86)","v":0},null,{"$f":"SUM(AD75:AD86)","v":0},{"$f":"SUM(AC75:AC86)","v":0},null,{"$f":"SUM(AG75:AG86)","v":0},{"$f":"SUM(AF75:AF86)","v":0},null,{"$f":"SUM(AJ75:AJ86)","v":0},{"$f":"SUM(AI75:AI86)","v":0},null,null,null,null,null,null,null,null,null,null,null,"Pld tally",null,"Error Flag",null,null,"Goals tally",null,"Pts tally"]
[null,"F","A",null,"F","A",null,"F","A",null,"F","A",null,"F","A",null,"F","A",null,"F","A",null,"F","A",null,"F","A",null,"F","A",null,"F","A",null,"F","A"]
[]
[]
[]
[]
[null,null,null,null,null,null,null,null,null,null,null,null,null,null,null,null,null,null,null,null,null,null,null,null,null,null,null,null,null,null,null,null,null,null,null,null,null,{"$f":"IF(D95=\"W\",1,0)+IF(G95=\"W\",1,0)+IF(J95=\"W\",1,0)+IF(M95=\"W\",1,0)+IF(P95=\"W\",1,0)+IF(S95=\"W\",1,0)+IF(V95=\"W\",1,0)+IF(Y95=\"W\",1,0)+IF(AB95=\"W\",1,0)+IF(AE95=\"W\",1,0)+IF(AH95=\"W\",1,0)+IF(AK95=\"W\",1,0)","v":0},{"$f":"IF(D95=\"D\",1,0)+IF(G95=\"D\",1,0)+IF(J95=\"D\",1,0)+IF(M95=\"D\",1,0)+IF(P95=\"D\",1,0)+IF(S95=\"D\",1,0)+IF(V95=\"D\",1,0)+IF(Y95=\"D\",1,0)+IF(AB95=\"D\",1,0)+IF(AE95=\"D\",1,0)+IF(AH95=\"D\",1,0)+IF(AK95=\"D\",1,0)","v":0},{"$f":"IF(D95=\"L\",1,0)+IF(G95=\"L\",1,0)+IF(J95=\"L\",1,0)+IF(M95=\"L\",1,0)+IF(P95=\"L\",1,0)+IF(S95=\"L\",1,0)+IF(V95=\"L\",1,0)+IF(Y95=\"L\",1,0)+IF(AB95=\"L\",1,0)+IF(AE95=\"L\",1,0)+IF(AH95=\"L\",1,0)+IF(AK95=\"L\",1,0)","v":0},{"$f":"(IF(#REF!=\"\",0,#REF!))+(IF(#REF!=\"\",0,#REF!))+(IF(#REF!=\"\",0,#REF!))+(IF(#REF!=\"\",0,#REF!))+(IF(N95=\"\",0,N95))+(IF(Q95=\"\",0,Q95))+(IF(T95=\"\",0,T95))+(IF(W95=\"\",0,W95))+(IF(Z95=\"\",0,Z95))+(IF(AC95=\"\",0,AC95))+(IF(AF95=\"\",0,AF95))+(IF(AI95=\"\",0,AI95))","v":{"$error":"#REF!"}},{"$f":"(IF(#REF!=\"\",0,#REF!))+(IF(#REF!=\"\",0,#REF!))+(IF(#REF!=\"\",0,#REF!))+(IF(#REF!=\"\",0,#REF!))+(IF(O95=\"\",0,O95))+(IF(R95=\"\",0,R95))+(IF(U95=\"\",0,U95))+(IF(X95=\"\",0,X95))+(IF(AA95=\"\",0,AA95))+(IF(AD95=\"\",0,AD95))+(IF(AG95=\"\",0,AG95))+(IF(AJ95=\"\",0,AJ95))","v":{"$error":"#REF!"}},{"$f":"B107","v":0},{"$f":"C107","v":0},{"$f":"D107","v":0},{"$f":"B109","v":0},{"$f":"C109","v":0},{"$f":"SUM(AW95:AY95)","v":0},{"$f":"AQ95+AL95","v":0},{"$f":"AR95+AM95","v":0},{"$f":"AS95+AN95","v":0},{"$f":"AT95+AO95","v":{"$error":"#REF!"}},{"$f":"AU95+AP95","v":{"$error":"#REF!"}},{"$f":"AW95*3+AX95","v":0},{"$f":"AZ95-BA95","v":{"$error":"#REF!"}}]
[null,null,null,null,null,null,null,null,null,null,null,null,null,null,null,null,null,null,null,null,null,null,null,null,null,null,null,null,null,null,null,null,null,null,null,null,null,{"$f":"IF(D96=\"W\",1,0)+IF(G96=\"W\",1,0)+IF(J96=\"W\",1,0)+IF(M96=\"W\",1,0)+IF(P96=\"W\",1,0)+IF(S96=\"W\",1,0)+IF(V96=\"W\",1,0)+IF(Y96=\"W\",1,0)+IF(AB96=\"W\",1,0)+IF(AE96=\"W\",1,0)+IF(AH96=\"W\",1,0)+IF(AK96=\"W\",1,0)","v":0},{"$f":"IF(D96=\"D\",1,0)+IF(G96=\"D\",1,0)+IF(J96=\"D\",1,0)+IF(M96=\"D\",1,0)+IF(P96=\"D\",1,0)+IF(S96=\"D\",1,0)+IF(V96=\"D\",1,0)+IF(Y96=\"D\",1,0)+IF(AB96=\"D\",1,0)+IF(AE96=\"D\",1,0)+IF(AH96=\"D\",1,0)+IF(AK96=\"D\",1,0)","v":0},{"$f":"IF(D96=\"L\",1,0)+IF(G96=\"L\",1,0)+IF(J96=\"L\",1,0)+IF(M96=\"L\",1,0)+IF(P96=\"L\",1,0)+IF(S96=\"L\",1,0)+IF(V96=\"L\",1,0)+IF(Y96=\"L\",1,0)+IF(AB96=\"L\",1,0)+IF(AE96=\"L\",1,0)+IF(AH96=\"L\",1,0)+IF(AK96=\"L\",1,0)","v":0},{"$f":"(IF(#REF!=\"\",0,#REF!))+(IF(#REF!=\"\",0,#REF!))+(IF(H96=\"\",0,H96))+(IF(#REF!=\"\",0,#REF!))+(IF(N96=\"\",0,N96))+(IF(Q96=\"\",0,Q96))+(IF(T96=\"\",0,T96))+(IF(W96=\"\",0,W96))+(IF(Z96=\"\",0,Z96))+(IF(AC96=\"\",0,AC96))+(IF(AF96=\"\",0,AF96))+(IF(AI96=\"\",0,AI96))","v":{"$error":"#REF!"}},{"$f":"(IF(#REF!=\"\",0,#REF!))+(IF(#REF!=\"\",0,#REF!))+(IF(I96=\"\",0,I96))+(IF(#REF!=\"\",0,#REF!))+(IF(O96=\"\",0,O96))+(IF(R96=\"\",0,R96))+(IF(U96=\"\",0,U96))+(IF(X96=\"\",0,X96))+(IF(AA96=\"\",0,AA96))+(IF(AD96=\"\",0,AD96))+(IF(AG96=\"\",0,AG96))+(IF(AJ96=\"\",0,AJ96))","v":{"$error":"#REF!"}},{"$f":"E107","v":0},{"$f":"F107","v":0},{"$f":"G107","v":0},{"$f":"E109","v":0},{"$f":"F109","v":0},{"$f":"SUM(AW96:AY96)","v":0},{"$f":"AQ96+AL96","v":0},0,0,{"$error":"#REF!"},{"$error":"#REF!"},0,{"$error":"#REF!"}]
[null,null,null,null,null,null,null,null,null,null,null,null,null,null,null,null,null,null,null,null,null,null,null,null,null,null,null,null,null,null,null,null,null,null,null,null,null,0,0,0,{"$f":"(IF(#REF!=\"\",0,#REF!))+(IF(#REF!=\"\",0,#REF!))+(IF(H97=\"\",0,H97))+(IF(#REF!=\"\",0,#REF!))+(IF(N97=\"\",0,N97))+(IF(Q97=\"\",0,Q97))+(IF(T97=\"\",0,T97))+(IF(W97=\"\",0,W97))+(IF(Z97=\"\",0,Z97))+(IF(AC97=\"\",0,AC97))+(IF(AF97=\"\",0,AF97))+(IF(AI97=\"\",0,AI97))","v":{"$error":"#REF!"}},{"$f":"(IF(#REF!=\"\",0,#REF!))+(IF(#REF!=\"\",0,#REF!))+(IF(I97=\"\",0,I97))+(IF(#REF!=\"\",0,#REF!))+(IF(O97=\"\",0,O97))+(IF(R97=\"\",0,R97))+(IF(U97=\"\",0,U97))+(IF(X97=\"\",0,X97))+(IF(AA97=\"\",0,AA97))+(IF(AD97=\"\",0,AD97))+(IF(AG97=\"\",0,AG97))+(IF(AJ97=\"\",0,AJ97))","v":{"$error":"#REF!"}},{"$f":"H107","v":0},{"$f":"I107","v":0},{"$f":"J107","v":0},{"$f":"H109","v":0},{"$f":"I109","v":0},0,0,0,0,{"$error":"#REF!"},{"$error":"#REF!"},0,{"$error":"#REF!"}]
[null,null,null,null,null,null,null,null,null,null,{"$f":"IF(Fixtures!$H$199=\"\",\"\",Fixtures!$H$199)","v":""},{"$f":"IF(Fixtures!$I$199=\"\",\"\",Fixtures!$I$199)","v":""},null,null,null,null,null,null,null,null,null,null,null,null,null,null,null,null,null,null,null,null,null,null,null,null,null,0,0,0,{"$f":"(IF(#REF!=\"\",0,#REF!))+(IF(#REF!=\"\",0,#REF!))+(IF(H98=\"\",0,H98))+(IF(#REF!=\"\",0,#REF!))+(IF(N98=\"\",0,N98))+(IF(Q98=\"\",0,Q98))+(IF(T98=\"\",0,T98))+(IF(W98=\"\",0,W98))+(IF(Z98=\"\",0,Z98))+(IF(AC98=\"\",0,AC98))+(IF(AF98=\"\",0,AF98))+(IF(AI98=\"\",0,AI98))","v":{"$error":"#REF!"}},{"$f":"(IF(#REF!=\"\",0,#REF!))+(IF(#REF!=\"\",0,#REF!))+(IF(I98=\"\",0,I98))+(IF(#REF!=\"\",0,#REF!))+(IF(O98=\"\",0,O98))+(IF(R98=\"\",0,R98))+(IF(U98=\"\",0,U98))+(IF(X98=\"\",0,X98))+(IF(AA98=\"\",0,AA98))+(IF(AD98=\"\",0,AD98))+(IF(AG98=\"\",0,AG98))+(IF(AJ98=\"\",0,AJ98))","v":{"$error":"#REF!"}},{"$f":"K107","v":0},{"$f":"L107","v":0},{"$f":"M107","v":0},{"$f":"K109","v":0},{"$f":"L109","v":0},0,0,0,0,{"$error":"#REF!"},{"$error":"#REF!"},0,{"$error":"#REF!"}]
[null,null,null,null,null,null,null,null,null,null,null,null,null,null,null,null,null,null,null,null,null,null,null,null,null,null,null,null,null,null,null,null,null,null,null,null,null,0,0,0,{"$f":"(IF(#REF!=\"\",0,#REF!))+(IF(E99=\"\",0,E99))+(IF(H99=\"\",0,H99))+(IF(#REF!=\"\",0,#REF!))+(IF(N99=\"\",0,N99))+(IF(Q99=\"\",0,Q99))+(IF(T99=\"\",0,T99))+(IF(W99=\"\",0,W99))+(IF(Z99=\"\",0,Z99))+(IF(AC99=\"\",0,AC99))+(IF(AF99=\"\",0,AF99))+(IF(AI99=\"\",0,AI99))","v":{"$error":"#REF!"}},{"$f":"(IF(#REF!=\"\",0,#REF!))+(IF(F99=\"\",0,F99))+(IF(I99=\"\",0,I99))+(IF(#REF!=\"\",0,#REF!))+(IF(O99=\"\",0,O99))+(IF(R99=\"\",0,R99))+(IF(U99=\"\",0,U99))+(IF(X99=\"\",0,X99))+(IF(AA99=\"\",0,AA99))+(IF(AD99=\"\",0,AD99))+(IF(AG99=\"\",0,AG99))+(IF(AJ99=\"\",0,AJ99))","v":{"$error":"#REF!"}},{"$f":"N107","v":0},{"$f":"O107","v":0},{"$f":"P107","v":0},{"$f":"N109","v":0},{"$f":"O109","v":0},0,0,0,0,{"$error":"#REF!"},{"$error":"#REF!"},0,{"$error":"#REF!"}]
[null,null,null,null,null,null,null,null,null,null,null,null,null,null,null,null,null,null,null,null,null,null,null,null,null,null,null,null,null,null,null,null,null,null,null,null,null,0,0,0,{"$f":"(IF(#REF!=\"\",0,#REF!))+(IF(E100=\"\",0,E100))+(IF(H100=\"\",0,H100))+(IF(#REF!=\"\",0,#REF!))+(IF(N100=\"\",0,N100))+(IF(Q100=\"\",0,Q100))+(IF(T100=\"\",0,T100))+(IF(W100=\"\",0,W100))+(IF(Z100=\"\",0,Z100))+(IF(AC100=\"\",0,AC100))+(IF(AF100=\"\",0,AF100))+(IF(AI100=\"\",0,AI100))","v":{"$error":"#REF!"}},{"$f":"(IF(#REF!=\"\",0,#REF!))+(IF(F100=\"\",0,F100))+(IF(I100=\"\",0,I100))+(IF(#REF!=\"\",0,#REF!))+(IF(O100=\"\",0,O100))+(IF(R100=\"\",0,R100))+(IF(U100=\"\",0,U100))+(IF(X100=\"\",0,X100))+(IF(AA100=\"\",0,AA100))+(IF(AD100=\"\",0,AD100))+(IF(AG100=\"\",0,AG100))+(IF(AJ100=\"\",0,AJ100))","v":{"$error":"#REF!"}},{"$f":"Q107","v":0},{"$f":"R107","v":0},{"$f":"S107","v":0},{"$f":"Q109","v":0},{"$f":"R109","v":0},0,0,0,0,{"$error":"#REF!"},{"$error":"#REF!"},0,{"$error":"#REF!"}]
[null,null,null,null,null,null,null,null,null,null,null,null,null,null,null,null,null,null,null,null,null,null,null,null,null,null,null,null,null,null,null,null,null,null,null,null,null,0,0,0,{"$f":"(IF(#REF!=\"\",0,#REF!))+(IF(E101=\"\",0,E101))+(IF(H101=\"\",0,H101))+(IF(#REF!=\"\",0,#REF!))+(IF(N101=\"\",0,N101))+(IF(Q101=\"\",0,Q101))+(IF(T101=\"\",0,T101))+(IF(W101=\"\",0,W101))+(IF(Z101=\"\",0,Z101))+(IF(AC101=\"\",0,AC101))+(IF(AF101=\"\",0,AF101))+(IF(AI101=\"\",0,AI101))","v":{"$error":"#REF!"}},{"$f":"(IF(#REF!=\"\",0,#REF!))+(IF(F101=\"\",0,F101))+(IF(I101=\"\",0,I101))+(IF(#REF!=\"\",0,#REF!))+(IF(O101=\"\",0,O101))+(IF(R101=\"\",0,R101))+(IF(U101=\"\",0,U101))+(IF(X101=\"\",0,X101))+(IF(AA101=\"\",0,AA101))+(IF(AD101=\"\",0,AD101))+(IF(AG101=\"\",0,AG101))+(IF(AJ101=\"\",0,AJ101))","v":{"$error":"#REF!"}},{"$f":"T107","v":0},{"$f":"U107","v":0},{"$f":"V107","v":0},{"$f":"T109","v":0},{"$f":"U109","v":0},0,0,0,0,{"$error":"#REF!"},{"$error":"#REF!"},0,{"$error":"#REF!"}]
[null,null,null,null,null,null,null,null,null,null,null,null,null,null,null,null,null,null,null,null,null,null,null,null,null,null,null,null,null,null,null,null,null,null,null,null,null,0,0,0,{"$f":"(IF(#REF!=\"\",0,#REF!))+(IF(E102=\"\",0,E102))+(IF(H102=\"\",0,H102))+(IF(K102=\"\",0,K102))+(IF(N102=\"\",0,N102))+(IF(Q102=\"\",0,Q102))+(IF(T102=\"\",0,T102))+(IF(W102=\"\",0,W102))+(IF(Z102=\"\",0,Z102))+(IF(AC102=\"\",0,AC102))+(IF(AF102=\"\",0,AF102))+(IF(AI102=\"\",0,AI102))","v":{"$error":"#REF!"}},{"$f":"(IF(#REF!=\"\",0,#REF!))+(IF(F102=\"\",0,F102))+(IF(I102=\"\",0,I102))+(IF(L102=\"\",0,L102))+(IF(O102=\"\",0,O102))+(IF(R102=\"\",0,R102))+(IF(U102=\"\",0,U102))+(IF(X102=\"\",0,X102))+(IF(AA102=\"\",0,AA102))+(IF(AD102=\"\",0,AD102))+(IF(AG102=\"\",0,AG102))+(IF(AJ102=\"\",0,AJ102))","v":{"$error":"#REF!"}},{"$f":"W107","v":0},{"$f":"X107","v":0},{"$f":"Y107","v":0},{"$f":"W109","v":0},{"$f":"X109","v":0},0,0,0,0,{"$error":"#REF!"},{"$error":"#REF!"},0,{"$error":"#REF!"}]
[null,null,null,null,null,null,null,null,null,null,null,null,null,null,null,null,null,null,null,null,null,null,null,null,null,null,null,null,null,null,null,null,null,null,null,null,null,0,0,0,{"$f":"(IF(#REF!=\"\",0,#REF!))+(IF(E103=\"\",0,E103))+(IF(H103=\"\",0,H103))+(IF(K103=\"\",0,K103))+(IF(N103=\"\",0,N103))+(IF(Q103=\"\",0,Q103))+(IF(T103=\"\",0,T103))+(IF(W103=\"\",0,W103))+(IF(Z103=\"\",0,Z103))+(IF(AC103=\"\",0,AC103))+(IF(AF103=\"\",0,AF103))+(IF(AI103=\"\",0,AI103))","v":{"$error":"#REF!"}},{"$f":"(IF(#REF!=\"\",0,#REF!))+(IF(F103=\"\",0,F103))+(IF(I103=\"\",0,I103))+(IF(L103=\"\",0,L103))+(IF(O103=\"\",0,O103))+(IF(R103=\"\",0,R103))+(IF(U103=\"\",0,U103))+(IF(X103=\"\",0,X103))+(IF(AA103=\"\",0,AA103))+(IF(AD103=\"\",0,AD103))+(IF(AG103=\"\",0,AG103))+(IF(AJ103=\"\",0,AJ103))","v":{"$error":"#REF!"}},{"$f":"Z107","v":0},{"$f":"AA107","v":0},{"$f":"AB107","v":0},{"$f":"Z109","v":0},{"$f":"AA109","v":0},0,0,0,0,{"$error":"#REF!"},{"$error":"#REF!"},0,{"$error":"#REF!"}]
[null,null,null,null,null,null,null,null,null,null,null,null,null,null,null,null,null,null,null,null,null,null,null,null,null,null,null,null,null,null,null,null,null,null,null,null,null,0,0,0,{"$f":"(IF(B104=\"\",0,B104))+(IF(E104=\"\",0,E104))+(IF(H104=\"\",0,H104))+(IF(K104=\"\",0,K104))+(IF(N104=\"\",0,N104))+(IF(Q104=\"\",0,Q104))+(IF(T104=\"\",0,T104))+(IF(W104=\"\",0,W104))+(IF(Z104=\"\",0,Z104))+(IF(AC104=\"\",0,AC104))+(IF(AF104=\"\",0,AF104))+(IF(AI104=\"\",0,AI104))","v":0},{"$f":"(IF(C104=\"\",0,C104))+(IF(F104=\"\",0,F104))+(IF(I104=\"\",0,I104))+(IF(L104=\"\",0,L104))+(IF(O104=\"\",0,O104))+(IF(R104=\"\",0,R104))+(IF(U104=\"\",0,U104))+(IF(X104=\"\",0,X104))+(IF(AA104=\"\",0,AA104))+(IF(AD104=\"\",0,AD104))+(IF(AG104=\"\",0,AG104))+(IF(AJ104=\"\",0,AJ104))","v":0},{"$f":"AC107","v":0},{"$f":"AD107","v":0},{"$f":"AE107","v":0},{"$f":"AC109","v":0},{"$f":"AD109","v":0},0,0,0,0,0,0,0,0]
[null,null,null,null,null,null,null,null,null,null,null,null,null,null,null,null,null,null,null,null,null,null,null,null,null,null,null,null,null,null,null,null,null,null,null,null,null,0,0,0,0,0,{"$f":"AF107","v":0},{"$f":"AG107","v":0},{"$f":"AH107","v":0},{"$f":"AF109","v":0},{"$f":"AG109","v":0},0,0,0,0,0,0,0,0]
[null,null,null,null,null,null,null,null,null,null,null,null,null,null,null,null,null,null,null,null,null,null,null,null,null,null,null,null,null,null,null,null,null,null,null,null,null,{"$f":"IF(D106=\"W\",1,0)+IF(G106=\"W\",1,0)+IF(J106=\"W\",1,0)+IF(M106=\"W\",1,0)+IF(P106=\"W\",1,0)+IF(S106=\"W\",1,0)+IF(V106=\"W\",1,0)+IF(Y106=\"W\",1,0)+IF(AB106=\"W\",1,0)+IF(AE106=\"W\",1,0)+IF(AH106=\"W\",1,0)+IF(AK106=\"W\",1,0)","v":0},{"$f":"IF(D106=\"D\",1,0)+IF(G106=\"D\",1,0)+IF(J106=\"D\",1,0)+IF(M106=\"D\",1,0)+IF(P106=\"D\",1,0)+IF(S106=\"D\",1,0)+IF(V106=\"D\",1,0)+IF(Y106=\"D\",1,0)+IF(AB106=\"D\",1,0)+IF(AE106=\"D\",1,0)+IF(AH106=\"D\",1,0)+IF(AK106=\"D\",1,0)","v":0},{"$f":"IF(D106=\"L\",1,0)+IF(G106=\"L\",1,0)+IF(J106=\"L\",1,0)+IF(M106=\"L\",1,0)+IF(P106=\"L\",1,0)+IF(S106=\"L\",1,0)+IF(V106=\"L\",1,0)+IF(Y106=\"L\",1,0)+IF(AB106=\"L\",1,0)+IF(AE106=\"L\",1,0)+IF(AH106=\"L\",1,0)+IF(AK106=\"L\",1,0)","v":0},0,{"$f":"(IF(C106=\"\",0,C106))+(IF(F106=\"\",0,F106))+(IF(I106=\"\",0,I106))+(IF(L106=\"\",0,L106))+(IF(O106=\"\",0,O106))+(IF(R106=\"\",0,R106))+(IF(U106=\"\",0,U106))+(IF(X106=\"\",0,X106))+(IF(AA106=\"\",0,AA106))+(IF(AD106=\"\",0,AD106))+(IF(AG106=\"\",0,AG106))+(IF(AJ106=\"\",0,AJ106))","v":0},{"$f":"AI107","v":0},{"$f":"AJ107","v":0},{"$f":"AK107","v":0},{"$f":"AI109","v":0},{"$f":"AJ109","v":0},0,0,0,0,0,0,0,0]
[null,null,null,null,null,null,null,null,null,null,null,null,null,null,null,null,null,null,null,null,null,null,null,null,null,null,null,null,null,null,null,null,null,null,null,null,null,null,null,null,null,null,null,null,null,null,null,{"$f":"SUM(AV95:AV106)","v":0},0,0,0,{"$error":"#REF!"},{"$error":"#REF!"},0,{"$error":"#REF!"}]
[null,null,null,null,null,null,null,null,null,null,null,null,null,null,null,null,null,null,null,null,null,null,null,null,null,null,null,null,null,null,null,null,null,null,null,null,null,null,null,null,null,null,null,null,null,null,null,{"$f":"IF(AV107=SUM(AW107:AY107),0,1)","v":0},null,{"$f":"AV108+BA108+BC108","v":{"$error":"#REF!"}},null,null,{"$f":"IF(AZ107=BA107,0,1)","v":{"$error":"#REF!"}},{"$f":"AW107*3+AX107","v":0},{"$f":"IF(BB107=BB108,0,1)","v":0}]
[null,null,null,null,null,null,null,null,null,null,null,null,null,null,null,null,null,null,null,null,null,null,null,null,null,null,null,null,null,null,null,null,null,null,null,null,null,null,null,null,null,null,null,null,null,null,null,"Pld tally",null,"Error Flag",null,null,"Goals tally",null,"Pts tally"]
[null,{"$f":"IF(Fixtures!H156=\"\",\"\",Fixtures!H156)","v":""},{"$f":"IF(Fixtures!I156=\"\",\"\",Fixtures!I156)","v":""}]
[]
[]
[]
[null,null,null,null,null,null,null,null,null,null,{"$f":"IF(Fixtures!H215=\"\",\"\",Fixtures!H215)","v":""},{"$f":"IF(Fixtures!I215=\"\",\"\",Fixtures!I215)","v":""}]

{"sheet":"Ladder","index":3,"n_rows":31,"n_cols":11,"rows_kept":31,"cut":false,"hidden":false,"merged":[]}
[]
[null,"Posn",{"$f":"Grid!A1","v":"(Season Incomplete)"},{"$f":"Grid!AV1","v":"P"},{"$f":"Grid!AW1","v":"W"},{"$f":"Grid!AX1","v":"D"},{"$f":"Grid!AY1","v":"L"},{"$f":"Grid!AZ1","v":"F"},{"$f":"Grid!BA1","v":"A"},{"$f":"Grid!BB1","v":"Pts"},{"$f":"Grid!BC1","v":"G/D"}]
[null,1,{"$f":"Grid!$A$4","v":"Celtic"},{"$f":"Grid!$AV$4","v":4},{"$f":"Grid!$AW$4","v":4},{"$f":"Grid!$AX$4","v":0},{"$f":"Grid!$AY$4","v":0},{"$f":"Grid!$AZ$4","v":12},{"$f":"Grid!$BA$4","v":0},{"$f":"Grid!$BB$4","v":12},{"$f":"Grid!$BC$4","v":12}]
[null,2,{"$f":"Grid!$A$13","v":"Aberdeen"},{"$f":"Grid!$AV$13","v":4},{"$f":"Grid!$AW$13","v":4},{"$f":"Grid!$AX$13","v":0},{"$f":"Grid!$AY$13","v":0},{"$f":"Grid!$AZ$13","v":8},{"$f":"Grid!$BA$13","v":2},{"$f":"Grid!$BB$13","v":12},{"$f":"Grid!$BC$13","v":6}]
[null,3,{"$f":"Grid!$A$5","v":"Dundee United"},{"$f":"Grid!$AV$5","v":4},{"$f":"Grid!$AW$5","v":2},{"$f":"Grid!$AX$5","v":2},{"$f":"Grid!$AY$5","v":0},{"$f":"Grid!$AZ$5","v":6},{"$f":"Grid!$BA$5","v":3},{"$f":"Grid!$BB$5","v":8},{"$f":"Grid!$BC$5","v":3}]
[null,4,{"$f":"Grid!$A$8","v":"Rangers"},{"$f":"Grid!$AV$8","v":4},{"$f":"Grid!$AW$8","v":2},{"$f":"Grid!$AX$8","v":1},{"$f":"Grid!$AY$8","v":1},{"$f":"Grid!$AZ$8","v":8},{"$f":"Grid!$BA$8","v":4},{"$f":"Grid!$BB$8","v":7},{"$f":"Grid!$BC$8","v":4}]
[null,5,{"$f":"Grid!$A$3","v":"Motherwell"},{"$f":"Grid!$AV$3","v":4},{"$f":"Grid!$AW$3","v":2},{"$f":"Grid!$AX$3","v":1},{"$f":"Grid!$AY$3","v":1},{"$f":"Grid!$AZ$3","v":6},{"$f":"Grid!$BA$3","v":4},{"$f":"Grid!$BB$3","v":7},{"$f":"Grid!$BC$3","v":2}]
[null,6,{"$f":"Grid!$A$11","v":"Dundee"},{"$f":"Grid!$AV$11","v":4},{"$f":"Grid!$AW$11","v":1},{"$f":"Grid!$AX$11","v":3},{"$f":"Grid!$AY$11","v":0},{"$f":"Grid!$AZ$11","v":9},{"$f":"Grid!$BA$11","v":7},{"$f":"Grid!$BB$11","v":6},{"$f":"Grid!$BC$11","v":2}]
[null,7,{"$f":"Grid!$A$6","v":"St Mirren"},{"$f":"Grid!$AV$6","v":4},{"$f":"Grid!$AW$6","v":1},{"$f":"Grid!$AX$6","v":1},{"$f":"Grid!$AY$6","v":2},{"$f":"Grid!$AZ$6","v":6},{"$f":"Grid!$BA$6","v":8},{"$f":"Grid!$BB$6","v":4},{"$f":"Grid!$BC$6","v":-2}]
[null,8,{"$f":"Grid!$A$7","v":"St Johnstone"},{"$f":"Grid!$AV$7","v":4},{"$f":"Grid!$AW$7","v":1},{"$f":"Grid!$AX$7","v":0},{"$f":"Grid!$AY$7","v":3},{"$f":"Grid!$AZ$7","v":5},{"$f":"Grid!$BA$7","v":6},{"$f":"Grid!$BB$7","v":3},{"$f":"Grid!$BC$7","v":-1}]
[null,9,{"$f":"Grid!$A$12","v":"Hibernian"},{"$f":"Grid!$AV$12","v":4},{"$f":"Grid!$AW$12","v":0},{"$f":"Grid!$AX$12","v":2},{"$f":"Grid!$AY$12","v":2},{"$f":"Grid!$AZ$12","v":3},{"$f":"Grid!$BA$12","v":8},{"$f":"Grid!$BB$12","v":2},{"$f":"Grid!$BC$12","v":-5}]
[null,10,{"$f":"Grid!$A$9","v":"Ross County"},{"$f":"Grid!$AV$9","v":4},{"$f":"Grid!$AW$9","v":0},{"$f":"Grid!$AX$9","v":2},{"$f":"Grid!$AY$9","v":2},{"$f":"Grid!$AZ$9","v":1},{"$f":"Grid!$BA$9","v":8},{"$f":"Grid!$BB$9","v":2},{"$f":"Grid!$BC$9","v":-7}]
[null,11,{"$f":"Grid!$A$2","v":"Heart of Midlothian"},{"$f":"Grid!$AV$2","v":4},{"$f":"Grid!$AW$2","v":0},{"$f":"Grid!$AX$2","v":1},{"$f":"Grid!$AY$2","v":3},{"$f":"Grid!$AZ$2","v":2},{"$f":"Grid!$BA$2","v":7},{"$f":"Grid!$BB$2","v":1},{"$f":"Grid!$BC$2","v":-5}]
[null,12,{"$f":"Grid!$A$10","v":"Kilmarnock"},{"$f":"Grid!$AV$10","v":4},{"$f":"Grid!$AW$10","v":0},{"$f":"Grid!$AX$10","v":1},{"$f":"Grid!$AY$10","v":3},{"$f":"Grid!$AZ$10","v":1},{"$f":"Grid!$BA$10","v":10},{"$f":"Grid!$BB$10","v":1},{"$f":"Grid!$BC$10","v":-9}]
[]
[]
[]
[null,"Posn",{"$f":"Grid!$A$74","v":"(Season Incomplete)"},{"$f":"D2","v":"P"},{"$f":"E2","v":"W"},"D","L","F","A","Pts","G/D"]
[null,1,{"$f":"Grid!$A$75","v":"Heart of Midlothian"},{"$f":"Grid!$AV$75","v":4},{"$f":"Grid!$AW$75","v":0},{"$f":"Grid!$AX$75","v":1},{"$f":"Grid!$AY$75","v":3},{"$f":"Grid!$AZ$75","v":2},{"$f":"Grid!$BA$75","v":7},{"$f":"Grid!$BB$75","v":1},{"$f":"Grid!$BC$75","v":-5}]
[null,2,{"$f":"Grid!$A$85","v":"Hibernian"},{"$f":"Grid!$AV$85","v":4},{"$f":"Grid!$AW$85","v":0},{"$f":"Grid!$AX$85","v":2},{"$f":"Grid!$AY$85","v":2},{"$f":"Grid!$AZ$85","v":3},{"$f":"Grid!$BA$85","v":8},{"$f":"Grid!$BB$85","v":2},{"$f":"Grid!$BC$85","v":-5}]
[null,3,{"$f":"Grid!$A$84","v":"Dundee"},{"$f":"Grid!$AV$84","v":4},{"$f":"Grid!$AW$84","v":1},{"$f":"Grid!$AX$84","v":3},{"$f":"Grid!$AY$84","v":0},{"$f":"Grid!$AZ$84","v":9},{"$f":"Grid!$BA$84","v":7},{"$f":"Grid!$BB$84","v":6},{"$f":"Grid!$BC$84","v":2}]
[null,4,{"$f":"Grid!$A$79","v":"St Mirren"},{"$f":"Grid!$AV$79","v":4},{"$f":"Grid!$AW$79","v":1},{"$f":"Grid!$AX$79","v":1},{"$f":"Grid!$AY$79","v":2},{"$f":"Grid!$AZ$79","v":6},{"$f":"Grid!$BA$79","v":8},{"$f":"Grid!$BB$79","v":4},{"$f":"Grid!$BC$79","v":-2}]
[null,5,{"$f":"Grid!$A$86","v":"Aberdeen"},{"$f":"Grid!$AV$86","v":4},{"$f":"Grid!$AW$86","v":4},{"$f":"Grid!$AX$86","v":0},{"$f":"Grid!$AY$86","v":0},{"$f":"Grid!$AZ$86","v":8},{"$f":"Grid!$BA$86","v":2},{"$f":"Grid!$BB$86","v":12},{"$f":"Grid!$BC$86","v":6}]
[null,6,{"$f":"Grid!$A$76","v":"Motherwell"},{"$f":"Grid!$AV$76","v":4},{"$f":"Grid!$AW$76","v":2},{"$f":"Grid!$AX$76","v":1},{"$f":"Grid!$AY$76","v":1},{"$f":"Grid!$AZ$76","v":6},{"$f":"Grid!$BA$76","v":4},{"$f":"Grid!$BB$76","v":7},{"$f":"Grid!$BC$76","v":2}]
[null,"Posn",{"$f":"C18","v":"(Season Incomplete)"},{"$f":"D18","v":"P"},{"$f":"E18","v":"W"},"D","L","F","A","Pts","G/D"]
[null,7,{"$f":"Grid!$A$83","v":"Kilmarnock"},{"$f":"Grid!$AV$83","v":4},{"$f":"Grid!$AW$83","v":0},{"$f":"Grid!$AX$83","v":1},{"$f":"Grid!$AY$83","v":3},{"$f":"Grid!$AZ$83","v":1},{"$f":"Grid!$BA$83","v":10},{"$f":"Grid!$BB$83","v":1},{"$f":"Grid!$BC$83","v":-9}]
[null,8,{"$f":"Grid!$A$80","v":"St Johnstone"},{"$f":"Grid!$AV$80","v":4},{"$f":"Grid!$AW$80","v":1},{"$f":"Grid!$AX$80","v":0},{"$f":"Grid!$AY$80","v":3},{"$f":"Grid!$AZ$80","v":5},{"$f":"Grid!$BA$80","v":6},{"$f":"Grid!$BB$80","v":3},{"$f":"Grid!$BC$80","v":-1}]
[null,9,{"$f":"Grid!$A$82","v":"Ross County"},{"$f":"Grid!$AV$82","v":4},{"$f":"Grid!$AW$82","v":0},{"$f":"Grid!$AX$82","v":2},{"$f":"Grid!$AY$82","v":2},{"$f":"Grid!$AZ$82","v":1},{"$f":"Grid!$BA$82","v":8},{"$f":"Grid!$BB$82","v":2},{"$f":"Grid!$BC$82","v":-7}]
[null,10,{"$f":"Grid!$A$78","v":"Dundee United"},{"$f":"Grid!$AV$78","v":4},{"$f":"Grid!$AW$78","v":2},{"$f":"Grid!$AX$78","v":2},{"$f":"Grid!$AY$78","v":0},{"$f":"Grid!$AZ$78","v":6},{"$f":"Grid!$BA$78","v":3},{"$f":"Grid!$BB$78","v":8},{"$f":"Grid!$BC$78","v":3}]
[null,11,{"$f":"Grid!$A$81","v":"Rangers"},{"$f":"Grid!$AV$81","v":4},{"$f":"Grid!$AW$81","v":2},{"$f":"Grid!$AX$81","v":1},{"$f":"Grid!$AY$81","v":1},{"$f":"Grid!$AZ$81","v":8},{"$f":"Grid!$BA$81","v":4},{"$f":"Grid!$BB$81","v":7},{"$f":"Grid!$BC$81","v":4}]
[null,12,{"$f":"Grid!$A$77","v":"Celtic"},{"$f":"Grid!$AV$77","v":4},{"$f":"Grid!$AW$77","v":4},{"$f":"Grid!$AX$77","v":0},{"$f":"Grid!$AY$77","v":0},{"$f":"Grid!$AZ$77","v":12},{"$f":"Grid!$BA$77","v":0},{"$f":"Grid!$BB$77","v":12},{"$f":"Grid!$BC$77","v":12}]

{"sheet":"Ladder1","index":4,"n_rows":30,"n_cols":11,"rows_kept":30,"cut":false,"hidden":false,"merged":[]}
[null,null,null,null,null,null,null,null,null,null,{"$f":"McRopod!B2","v":"v1 - Pre-Split"}]
[null,"Posn",{"$f":"Ladder!C2","v":"(Season Incomplete)"},{"$f":"Ladder!D2","v":"P"},{"$f":"Ladder!E2","v":"W"},{"$f":"Ladder!F2","v":"D"},{"$f":"Ladder!G2","v":"L"},{"$f":"Ladder!H2","v":"F"},{"$f":"Ladder!I2","v":"A"},{"$f":"Ladder!J2","v":"Pts"},{"$f":"Ladder!K2","v":"G/D"}]
[null,1,{"$f":"Ladder!C3","v":"Celtic"},{"$f":"Ladder!D3","v":4},{"$f":"Ladder!E3","v":4},{"$f":"Ladder!F3","v":0},{"$f":"Ladder!G3","v":0},{"$f":"Ladder!H3","v":12},{"$f":"Ladder!I3","v":0},{"$f":"Ladder!J3","v":12},{"$f":"IF(Ladder!K3=0,\"=\",Ladder!K3)","v":12}]
[null,2,{"$f":"Ladder!C4","v":"Aberdeen"},{"$f":"Ladder!D4","v":4},{"$f":"Ladder!E4","v":4},{"$f":"Ladder!F4","v":0},{"$f":"Ladder!G4","v":0},{"$f":"Ladder!H4","v":8},{"$f":"Ladder!I4","v":2},{"$f":"Ladder!J4","v":12},{"$f":"IF(Ladder!K4=0,\"=\",Ladder!K4)","v":6}]
[null,3,{"$f":"Ladder!C5","v":"Dundee United"},{"$f":"Ladder!D5","v":4},{"$f":"Ladder!E5","v":2},{"$f":"Ladder!F5","v":2},{"$f":"Ladder!G5","v":0},{"$f":"Ladder!H5","v":6},{"$f":"Ladder!I5","v":3},{"$f":"Ladder!J5","v":8},{"$f":"IF(Ladder!K5=0,\"=\",Ladder!K5)","v":3}]
[null,4,{"$f":"Ladder!C6","v":"Rangers"},{"$f":"Ladder!D6","v":4},{"$f":"Ladder!E6","v":2},{"$f":"Ladder!F6","v":1},{"$f":"Ladder!G6","v":1},{"$f":"Ladder!H6","v":8},{"$f":"Ladder!I6","v":4},{"$f":"Ladder!J6","v":7},{"$f":"IF(Ladder!K6=0,\"=\",Ladder!K6)","v":4}]
[null,5,{"$f":"Ladder!C7","v":"Motherwell"},{"$f":"Ladder!D7","v":4},{"$f":"Ladder!E7","v":2},{"$f":"Ladder!F7","v":1},{"$f":"Ladder!G7","v":1},{"$f":"Ladder!H7","v":6},{"$f":"Ladder!I7","v":4},{"$f":"Ladder!J7","v":7},{"$f":"IF(Ladder!K7=0,\"=\",Ladder!K7)","v":2}]
[null,6,{"$f":"Ladder!C8","v":"Dundee"},{"$f":"Ladder!D8","v":4},{"$f":"Ladder!E8","v":1},{"$f":"Ladder!F8","v":3},{"$f":"Ladder!G8","v":0},{"$f":"Ladder!H8","v":9},{"$f":"Ladder!I8","v":7},{"$f":"Ladder!J8","v":6},{"$f":"IF(Ladder!K8=0,\"=\",Ladder!K8)","v":2}]
[null,7,{"$f":"Ladder!C9","v":"St Mirren"},{"$f":"Ladder!D9","v":4},{"$f":"Ladder!E9","v":1},{"$f":"Ladder!F9","v":1},{"$f":"Ladder!G9","v":2},{"$f":"Ladder!H9","v":6},{"$f":"Ladder!I9","v":8},{"$f":"Ladder!J9","v":4},{"$f":"IF(Ladder!K9=0,\"=\",Ladder!K9)","v":-2}]
[null,8,{"$f":"Ladder!C10","v":"St Johnstone"},{"$f":"Ladder!D10","v":4},{"$f":"Ladder!E10","v":1},{"$f":"Ladder!F10","v":0},{"$f":"Ladder!G10","v":3},{"$f":"Ladder!H10","v":5},{"$f":"Ladder!I10","v":6},{"$f":"Ladder!J10","v":3},{"$f":"IF(Ladder!K10=0,\"=\",Ladder!K10)","v":-1}]
[null,9,{"$f":"Ladder!C11","v":"Hibernian"},{"$f":"Ladder!D11","v":4},{"$f":"Ladder!E11","v":0},{"$f":"Ladder!F11","v":2},{"$f":"Ladder!G11","v":2},{"$f":"Ladder!H11","v":3},{"$f":"Ladder!I11","v":8},{"$f":"Ladder!J11","v":2},{"$f":"IF(Ladder!K11=0,\"=\",Ladder!K11)","v":-5}]
[null,10,{"$f":"Ladder!C12","v":"Ross County"},{"$f":"Ladder!D12","v":4},{"$f":"Ladder!E12","v":0},{"$f":"Ladder!F12","v":2},{"$f":"Ladder!G12","v":2},{"$f":"Ladder!H12","v":1},{"$f":"Ladder!I12","v":8},{"$f":"Ladder!J12","v":2},{"$f":"IF(Ladder!K12=0,\"=\",Ladder!K12)","v":-7}]
[null,11,{"$f":"Ladder!C13","v":"Heart of Midlothian"},{"$f":"Ladder!D13","v":4},{"$f":"Ladder!E13","v":0},{"$f":"Ladder!F13","v":1},{"$f":"Ladder!G13","v":3},{"$f":"Ladder!H13","v":2},{"$f":"Ladder!I13","v":7},{"$f":"Ladder!J13","v":1},{"$f":"IF(Ladder!K13=0,\"=\",Ladder!K13)","v":-5}]
[null,12,{"$f":"Ladder!C14","v":"Kilmarnock"},{"$f":"Ladder!D14","v":4},{"$f":"Ladder!E14","v":0},{"$f":"Ladder!F14","v":1},{"$f":"Ladder!G14","v":3},{"$f":"Ladder!H14","v":1},{"$f":"Ladder!I14","v":10},{"$f":"Ladder!J14","v":1},{"$f":"IF(Ladder!K14=0,\"=\",Ladder!K14)","v":-9}]
[]
[]
[null,{"$f":"Ladder!B18","v":"Posn"},{"$f":"Ladder!C18","v":"(Season Incomplete)"},{"$f":"Ladder!D18","v":"P"},{"$f":"Ladder!E18","v":"W"},{"$f":"Ladder!F18","v":"D"},{"$f":"Ladder!G18","v":"L"},{"$f":"Ladder!H18","v":"F"},{"$f":"Ladder!I18","v":"A"},{"$f":"Ladder!J18","v":"Pts"},{"$f":"Ladder!K18","v":"G/D"}]
[null,{"$f":"Ladder!B19","v":1},{"$f":"Ladder!C19","v":"Heart of Midlothian"},{"$f":"Ladder!D19","v":4},{"$f":"Ladder!E19","v":0},{"$f":"Ladder!F19","v":1},{"$f":"Ladder!G19","v":3},{"$f":"Ladder!H19","v":2},{"$f":"Ladder!I19","v":7},{"$f":"Ladder!J19","v":1},{"$f":"Ladder!K19","v":-5}]
[null,{"$f":"Ladder!B20","v":2},{"$f":"Ladder!C20","v":"Hibernian"},{"$f":"Ladder!D20","v":4},{"$f":"Ladder!E20","v":0},{"$f":"Ladder!F20","v":2},{"$f":"Ladder!G20","v":2},{"$f":"Ladder!H20","v":3},{"$f":"Ladder!I20","v":8},{"$f":"Ladder!J20","v":2},{"$f":"Ladder!K20","v":-5}]
[null,{"$f":"Ladder!B21","v":3},{"$f":"Ladder!C21","v":"Dundee"},{"$f":"Ladder!D21","v":4},{"$f":"Ladder!E21","v":1},{"$f":"Ladder!F21","v":3},{"$f":"Ladder!G21","v":0},{"$f":"Ladder!H21","v":9},{"$f":"Ladder!I21","v":7},{"$f":"Ladder!J21","v":6},{"$f":"Ladder!K21","v":2}]
[null,{"$f":"Ladder!B22","v":4},{"$f":"Ladder!C22","v":"St Mirren"},{"$f":"Ladder!D22","v":4},{"$f":"Ladder!E22","v":1},{"$f":"Ladder!F22","v":1},{"$f":"Ladder!G22","v":2},{"$f":"Ladder!H22","v":6},{"$f":"Ladder!I22","v":8},{"$f":"Ladder!J22","v":4},{"$f":"Ladder!K22","v":-2}]
[null,{"$f":"Ladder!B23","v":5},{"$f":"Ladder!C23","v":"Aberdeen"},{"$f":"Ladder!D23","v":4},{"$f":"Ladder!E23","v":4},{"$f":"Ladder!F23","v":0},{"$f":"Ladder!G23","v":0},{"$f":"Ladder!H23","v":8},{"$f":"Ladder!I23","v":2},{"$f":"Ladder!J23","v":12},{"$f":"Ladder!K23","v":6}]
[null,{"$f":"Ladder!B24","v":6},{"$f":"Ladder!C24","v":"Motherwell"},{"$f":"Ladder!D24","v":4},{"$f":"Ladder!E24","v":2},{"$f":"Ladder!F24","v":1},{"$f":"Ladder!G24","v":1},{"$f":"Ladder!H24","v":6},{"$f":"Ladder!I24","v":4},{"$f":"Ladder!J24","v":7},{"$f":"Ladder!K24","v":2}]
[null,{"$f":"Ladder!B25","v":"Posn"},{"$f":"Ladder!C25","v":"(Season Incomplete)"},{"$f":"Ladder!D25","v":"P"},{"$f":"Ladder!E25","v":"W"},{"$f":"Ladder!F25","v":"D"},{"$f":"Ladder!G25","v":"L"},{"$f":"Ladder!H25","v":"F"},{"$f":"Ladder!I25","v":"A"},{"$f":"Ladder!J25","v":"Pts"},{"$f":"Ladder!K25","v":"G/D"}]
[null,{"$f":"Ladder!B26","v":7},{"$f":"Ladder!C26","v":"Kilmarnock"},{"$f":"Ladder!D26","v":4},{"$f":"Ladder!E26","v":0},{"$f":"Ladder!F26","v":1},{"$f":"Ladder!G26","v":3},{"$f":"Ladder!H26","v":1},{"$f":"Ladder!I26","v":10},{"$f":"Ladder!J26","v":1},{"$f":"Ladder!K26","v":-9}]
[null,{"$f":"Ladder!B27","v":8},{"$f":"Ladder!C27","v":"St Johnstone"},{"$f":"Ladder!D27","v":4},{"$f":"Ladder!E27","v":1},{"$f":"Ladder!F27","v":0},{"$f":"Ladder!G27","v":3},{"$f":"Ladder!H27","v":5},{"$f":"Ladder!I27","v":6},{"$f":"Ladder!J27","v":3},{"$f":"Ladder!K27","v":-1}]
[null,{"$f":"Ladder!B28","v":9},{"$f":"Ladder!C28","v":"Ross County"},{"$f":"Ladder!D28","v":4},{"$f":"Ladder!E28","v":0},{"$f":"Ladder!F28","v":2},{"$f":"Ladder!G28","v":2},{"$f":"Ladder!H28","v":1},{"$f":"Ladder!I28","v":8},{"$f":"Ladder!J28","v":2},{"$f":"Ladder!K28","v":-7}]
[null,{"$f":"Ladder!B29","v":10},{"$f":"Ladder!C29","v":"Dundee United"},{"$f":"Ladder!D29","v":4},{"$f":"Ladder!E29","v":2},{"$f":"Ladder!F29","v":2},{"$f":"Ladder!G29","v":0},{"$f":"Ladder!H29","v":6},{"$f":"Ladder!I29","v":3},{"$f":"Ladder!J29","v":8},{"$f":"Ladder!K29","v":3}]
[null,{"$f":"Ladder!B30","v":11},{"$f":"Ladder!C30","v":"Rangers"},{"$f":"Ladder!D30","v":4},{"$f":"Ladder!E30","v":2},{"$f":"Ladder!F30","v":1},{"$f":"Ladder!G30","v":1},{"$f":"Ladder!H30","v":8},{"$f":"Ladder!I30","v":4},{"$f":"Ladder!J30","v":7},{"$f":"Ladder!K30","v":4}]
[null,{"$f":"Ladder!B31","v":12},{"$f":"Ladder!C31","v":"Celtic"},{"$f":"Ladder!D31","v":4},{"$f":"Ladder!E31","v":4},{"$f":"Ladder!F31","v":0},{"$f":"Ladder!G31","v":0},{"$f":"Ladder!H31","v":12},{"$f":"Ladder!I31","v":0},{"$f":"Ladder!J31","v":12},{"$f":"Ladder!K31","v":12}]

{"sheet":"McRopod","index":5,"n_rows":58,"n_cols":2,"rows_kept":58,"cut":false,"hidden":false,"merged":[]}
[]
[null,{"$f":"Fixtures!I1","v":"v1 - Pre-Split"}]
[]
[null,"You'll have fun with this!"]
[]
[null,"Keep tabs on the 2024/2025 Scottish Premier"]
[null,"League with this McRopod Concepts Sports"]
[null,"System.  No more scrappy bits of paper, no"]
[null,"more need to consult your calculator."]
[]
[null,"Just enter a score for a fixture and let McRopod"]
[null,"do the rest!"]
[]
[null,"Use it not only to record actual scores, but to see the consequences of your predictions."]
[null,"Change one or two predicted results, then see what the new outcome is instantly,"]
[null,"automatically, and accurately."]
[]
[null,"Before you do anything else - let's maximise the image!  Go to <View>, then"]
[null,"select <Full Screen>.  If you want to return to your normal screen layout afterwards,"]
[null,"all you have to do is select <View>, and then <Full Screen> again."]
[]
[null,"Instructions for use"]
[]
[null,"Dead easy really.  You'll see that there are two pages that you can go to by pressing the"]
[null,"buttons at the top of this page.  One leads you to the current Ladder, the other to the Fixtures"]
[null,"and Results.  The Ladder is updated each time you chose that page - it can never get out of"]
[null,"order, basing itself on the present position and including whatever results you input."]
[]
[null,"In the Fixtures and Results page - you'll see all the fixtures from Round One to the Pre-Split"]
[null,"of the 2024/2025 season.  By inputting a score in the appropriate cells in this page,"]
[null,"you'll cause the Ladder to be varied, and you'll see it updated and re-ordered each time "]
[null,"you check it out.  Come back for the Post-Split complete season update once those fixtures are released."]
[]
[null,"Remember the clubs will each meet each other three times in the SPL"]
[null,"from Round 1 to Round 33, then play another five fixtures depending upon their Ladder positions"]
[null,"with the other teams in their half of the Ladder.  This means that the fixtures from Round 34 to"]
[null,"Round 38 will only be determined after all the games up to and including Round 33 have been"]
[null,"played."]
[]
[null,"Return to the McRopod Web-site later in the season to download the version which will contain"]
[null,"these remaining fixtures.  You'll be able to keep an eye on which teams are likely to be in"]
[null,"which half of the draw from Round 34 on, because the Ladder has been divided into a top half and"]
[null,"a bottom half."]
[]
[null,"When you enter a score you’ll need to make sure that only a whole positive number or a blank appears"]
[null,"in the result cells.  If anything else appears you may get an error flag elsewhere: <######> for example."]
[null,""]
[null,"If ever this happens, check to make sure that you have not input something other than a whole positive"]
[null,"number or a blank."]
[]
[null,"Told you it was simple, eh?"]
[]
[null,"And what McRopod can do for the Scottish Premier Division, it can do for any other League,"]
[null,"professional or amateur.  So if your competition needs a Sports System designed, contact"]
[null,"McRopod Concepts and let us know your requirements."]
[]
[null,"Alan Clark"]
[null,"McRopod Concepts"]